program: Gaussian 09
title: 000269170
version: EM64L-G09RevD.01
frameworkgroup: C1[X(C15H10BrNO)]
method: RPBEPBE
basis: SDD
operation: Freq
keyword: #p
keyword: freq=noraman
keyword: PBEPBE/SDD
title: #p freq=noraman PBEPBE/SDD
converged: YES YES NO NO
title: Mulliken charges:
elementType: Br O N C C C C C C C C C C C C C C C H H H H H H H H H H
charge: 0.019589 -0.268291 -0.461776 0.276750 0.251578 0.188706 0.394252 -0.447408 0.125258 -0.396911 -0.361930 -0.419380 -0.364818 -0.208249 -0.258441 -0.197924 -0.232727 -0.223555 0.329967 0.267470 0.231111 0.280697 0.271108 0.231346 0.234052 0.255231 0.240888 0.243409
chargesum: 0.00000
title: Mulliken charges with hydrogens summed into heavy atoms:
elementType: Br O N C C C C C C C C C C C C C C C
charge: 0.019589 -0.268291 -0.131809 0.276750 0.251578 0.188706 0.394252 -0.179938 0.125258 -0.165800 -0.081233 -0.419380 -0.093710 0.023097 -0.024389 0.057307 0.008161 0.019854
polarizability: 2.75170974e+02 2.13738112e+01 1.99171691e+02 1.56769073e+01 -1.37794437e+01 1.05527379e+02
1716.lowfreq: -5.6325 -4.3068 -0.0009 -0.0009 -0.0008 3.2123 24.6791 44.4134 71.9254
frequency: 24.5896 44.4031 71.9243 114.0867 138.2646 160.0803 175.1225 216.3958 242.4832 275.4503 297.8277 324.2221 372.4061 431.4928 444.4908 476.9121 495.6463 515.2598 528.4759 577.2459 588.5856 593.4175 635.9843 652.7717 667.8258 677.2899 730.9600 734.3363 765.2910 767.8645 780.8554 846.2498 860.7740 874.7276 879.4302 919.6262 960.7878 967.2274 994.6750 1001.2663 1001.5545 1018.7626 1037.7082 1067.1094 1086.9989 1120.8872 1133.5807 1170.8311 1176.4064 1229.7971 1251.8258 1258.6220 1272.5428 1301.6357 1351.3812 1359.4689 1405.3870 1416.9930 1429.9531 1458.2952 1470.9382 1506.5120 1539.5810 1562.9762 1589.2387 1599.6708 1609.4458 1627.8334 3119.8166 3140.0720 3141.7154 3152.5240 3153.3104 3166.4268 3169.0742 3178.4746 3180.6096 3546.3917
redmass: 8.0953 7.4106 4.9905 5.4438 5.0683 9.2339 4.2545 7.2450 5.3073 5.6897 5.8592 8.1355 5.6833 3.5681 3.5536 4.8124 8.0588 4.9090 3.2415 6.6249 1.8838 2.3043 6.2368 5.6560 3.0174 6.6921 3.7692 4.7949 2.1680 1.3138 1.6742 5.4161 1.4477 1.5368 1.4514 6.1328 1.3817 1.3658 1.3524 6.6595 1.3336 3.0679 2.3834 2.3106 2.6097 1.6912 1.5972 1.0729 1.0603 1.9782 1.6621 1.6410 2.1143 2.2837 2.8272 4.2275 4.7321 2.4571 2.3920 2.6541 2.9864 3.6804 9.2950 5.8573 3.9668 6.2786 7.9132 6.1338 1.0882 1.0884 1.0860 1.0906 1.0936 1.0952 1.1002 1.1002 1.0926 1.0777
irintensity: 3.6019 0.1623 1.1190 0.8389 0.4046 0.6632 0.0714 0.2248 0.2047 4.7449 8.2775 2.8384 0.7509 1.5191 6.4293 7.7238 1.4291 3.4805 17.2089 2.5504 29.1482 23.6578 11.2537 4.5753 0.7385 18.5305 2.2566 3.7304 21.8118 116.2312 53.0165 2.8188 22.7299 1.1350 3.1539 11.9071 1.0440 2.1971 0.1583 45.0551 1.1479 8.7935 6.8595 12.1288 5.6006 2.4644 31.0090 1.5146 0.4151 2.7809 6.3867 2.6612 4.8837 13.2780 5.8623 3.8304 20.2960 23.7780 42.2483 13.1901 95.5915 121.8394 125.0263 20.6250 34.5552 31.4458 160.0931 119.6035 6.1259 9.8540 0.4899 6.8839 6.5209 7.9961 30.5533 12.1925 3.6973 55.3897
temp: 298.150 k
press: 1.00000 atm
elementType: 35 8 7 6 6 6 6 6 6 6 6 6 6 6 6 6 6 6 1 1 1 1 1 1 1 1 1 1
symmnumber: 1
zpe: 543290.5 jmol-1
zpe.correction: 0.206928 hartree
zpe.thermalcorrener: 0.221278 hartree
zpe.thermalcorrenthalpy: 0.222222 hartree
zpe.thermalcorrgfe: 0.163809 hartree
zpe.sumelectzpe: -719.828587 hartree
zpe.sumelectthermal: -719.814237 hartree
zpe.sumelectthermalent: -719.813293 hartree
zpe.sumelectthermalfe: -719.871707 hartree
dipole: 4.1914 -2.9219 4.0068
dipole: 6.4930
quadrupole: -98.4432 -114.4613 -118.1073
quadrupole: 19.2097 -3.5637 4.0308
quadrupole: 11.8941 -4.1240 -7.7701 19.2097 -3.5637 4.0308
hfenergy: -720.0355154 hartree
pointgroup: C01 [X(C15H10Br1N1O1)]
dipole: -1.4760649 2.0841666 0.0563381 debye
polarizability: 280.1248075|-2.1366044|163.1170733|-14.156331|-45.5803462|136.6281632 unknown
InChI: InChI=1S/C15H10BrNO/c16-12-7-3-1-5-10(12)14-9-15(18)11-6-2-4-8-13(11)17-14/h1-9,17H
charge 0 multiplicity 1
28 atoms
Br -1.829084 1.240201 -2.497676
O  2.021722 -2.816345 0.855939
N  0.344592 0.872327 -0.056128
C  -0.483762 -0.212177 0.211959
C  1.741698 0.766357 -0.070152
C  2.348194 -0.489589 0.237506
C  -1.957759 0.024546 0.217352
C  0.065662 -1.449406 0.517062
C  1.509559 -1.679986 0.562586
C  2.544775 1.899396 -0.378189
C  3.764136 -0.58601 0.22764
C  -2.693134 0.662652 -0.81905
C  -2.697224 -0.425608 1.349648
C  3.943355 1.775695 -0.381237
C  4.560233 0.52954 -0.077463
C  -4.08823 0.854424 -0.736426
C  -4.090804 -0.246686 1.445555
C  -4.789542 0.401764 0.402824
H  -0.077347 1.773495 -0.286254
H  -0.590477 -2.302333 0.706746
H  2.071337 2.860437 -0.614096
H  4.199004 -1.562225 0.467221
H  -2.145347 -0.906814 2.163652
H  4.562016 2.647554 -0.62055
H  5.651834 0.446002 -0.083055
H  -4.621035 1.33953 -1.559025
H  -4.625731 -0.604415 2.330958
H  -5.872242 0.551977 0.46466
