program: Gaussian 09
title: 000269168
version: EM64L-G09RevD.01
frameworkgroup: C1[X(C15H9BrClN)]
method: RPBEPBE
basis: SDD
operation: Freq
keyword: #p
keyword: freq=noraman
keyword: PBEPBE/SDD
title: #p freq=noraman PBEPBE/SDD
converged: YES YES NO NO
title: Mulliken charges:
elementType: Br Cl N C C C C C C C C C C C C C C C H H H H H H H H H
charge: 0.016868 -0.043160 0.003889 0.464256 0.013477 -0.110178 0.452183 -0.196690 -0.290368 -0.358106 -0.310787 -0.387460 -0.370880 -0.239394 -0.224116 -0.203349 -0.239812 -0.226478 0.277228 0.255312 0.269737 0.252915 0.234188 0.236444 0.251052 0.235097 0.238132
chargesum: 0.00000
title: Mulliken charges with hydrogens summed into heavy atoms:
elementType: Br Cl N C C C C C C C C C C C C C C C
charge: 0.016868 -0.043160 0.003889 0.464256 0.013477 -0.110178 0.452183 -0.196690 -0.013140 -0.102795 -0.041050 -0.387460 -0.117965 -0.005206 0.012328 0.047702 -0.004716 0.011655
polarizability: 2.86692019e+02 -3.45684409e+01 2.15585118e+02 -1.08871748e+01 -3.36637666e+00 1.05124249e+02
1716.lowfreq: -5.0138 -2.2011 -0.0029 -0.0025 -0.0023 5.8097 22.7441 45.0155 66.6959
frequency: 22.7319 45.0038 66.6938 108.3063 133.5922 143.7303 178.4039 191.9641 228.4410 247.0677 290.9253 328.3532 358.3613 390.2886 420.8709 436.6378 474.8464 516.4918 535.7973 559.1967 567.6485 587.0313 635.4683 656.0720 686.6585 721.7912 736.4809 763.4844 778.0716 785.4122 806.3744 855.6077 866.9295 885.0245 885.2231 945.0176 952.9079 972.5290 988.0740 999.9848 1004.4140 1019.6365 1034.5133 1074.2489 1118.1459 1132.7216 1163.7271 1175.2043 1188.9453 1246.5926 1259.7958 1279.4289 1288.0932 1347.9518 1363.1707 1375.0112 1396.6165 1416.0912 1446.7842 1469.6906 1484.1476 1539.5834 1566.0992 1582.8846 1598.3710 1622.9195 3132.3559 3136.8864 3143.9869 3150.1125 3160.4871 3165.1014 3174.5423 3175.8948 3179.4864
redmass: 10.5794 7.9612 5.5186 5.0150 5.1068 10.3579 5.7192 6.6670 7.0331 7.1561 6.2587 7.9004 8.9162 6.3011 3.4524 3.4760 4.3401 7.3106 3.7033 5.5911 5.7568 4.6094 6.6219 7.2089 4.2480 6.2248 3.1319 1.3899 1.3537 3.2140 6.8211 5.6680 1.4042 1.4506 1.6339 6.1541 1.3865 1.3578 1.3398 1.3323 6.7937 2.3222 2.9507 2.1712 1.8083 1.6285 1.1914 1.0603 1.5031 1.7325 1.4691 3.6726 2.7805 4.7392 6.8698 3.3910 3.1113 2.2344 2.6188 3.3417 3.5833 7.0936 6.1078 8.2789 6.8038 6.7243 1.0863 1.0859 1.0900 1.0896 1.0950 1.0958 1.1000 1.0998 1.0935
irintensity: 0.1692 0.7967 0.7518 0.2052 0.7208 0.1613 1.2566 2.3650 1.4536 1.4911 0.2652 2.0044 4.6712 1.6879 4.0831 7.3814 3.6137 0.5709 1.2763 12.3911 3.1946 0.4826 8.7512 39.7275 1.6169 8.1918 10.8927 68.3827 93.1603 9.4706 33.2255 7.5406 5.0497 9.7085 2.5000 14.5347 1.2671 2.1303 0.2658 0.1019 43.5183 3.7594 12.5715 9.3989 1.3637 1.4998 7.3572 0.6249 7.1977 2.8494 3.7998 22.1155 2.0119 13.0663 9.1797 4.2063 73.3853 36.2756 16.4643 23.3069 61.7659 35.8281 21.6910 92.9680 8.2777 8.1166 3.0169 3.0342 8.7739 7.0165 14.0379 13.8589 20.6095 19.4815 0.1299
temp: 298.150 k
press: 1.00000 atm
elementType: 35 17 7 6 6 6 6 6 6 6 6 6 6 6 6 6 6 6 1 1 1 1 1 1 1 1 1
symmnumber: 1
zpe: 504627.5 jmol-1
zpe.correction: 0.192202 hartree
zpe.thermalcorrener: 0.206764 hartree
zpe.thermalcorrenthalpy: 0.207709 hartree
zpe.thermalcorrgfe: 0.148341 hartree
zpe.sumelectzpe: -1104.057269 hartree
zpe.sumelectthermal: -1104.042707 hartree
zpe.sumelectthermalent: -1104.041763 hartree
zpe.sumelectthermalfe: -1104.101131 hartree
dipole: 0.2156 1.1241 0.9124
dipole: 1.4638
quadrupole: -98.4405 -111.5867 -123.5432
quadrupole: -12.6403 -0.5798 1.3804
quadrupole: 12.7497 -0.3966 -12.3530 -12.6403 -0.5798 1.3804
hfenergy: -1104.2494716 hartree
pointgroup: C01 [X(C15H9Br1Cl1N1)]
dipole: -0.029984 0.1234832 0.5616923 debye
polarizability: 299.0697842|-2.8283927|170.2626508|-16.0838211|46.5914441|138.0689502 unknown
InChI: InChI=1S/C15H9BrClN/c16-12-7-3-1-5-10(12)15-9-13(17)11-6-2-4-8-14(11)18-15/h1-9H
charge 0 multiplicity 1
27 atoms
Br -1.872385 -1.253037 -2.511115
Cl 2.154848 3.230544 0.860541
N  0.311913 -0.937859 -0.104913
C  2.341353 0.493006 0.193104
C  -0.462841 0.130401 0.171652
C  1.687257 -0.774229 -0.101803
C  -1.946581 -0.056484 0.202923
C  1.462263 1.584106 0.484043
C  0.082696 1.428323 0.480245
C  3.768974 0.568079 0.174731
C  2.498764 -1.915264 -0.401808
C  -2.700909 -0.678456 -0.827513
C  -2.65889 0.406155 1.34563
C  4.528694 -0.565737 -0.122774
C  3.89119 -1.813995 -0.412698
C  -4.096817 -0.855525 -0.716396
C  -4.052065 0.23511 1.471298
C  -4.77334 -0.403658 0.438401
H  -0.584285 2.270622 0.676481
H  4.253453 1.524217 0.39602
H  1.981151 -2.853964 -0.620414
H  -2.092808 0.877993 2.156726
H  5.622023 -0.50205 -0.135349
H  4.503173 -2.692237 -0.644568
H  -4.649692 -1.333491 -1.530196
H  -4.568346 0.590531 2.368941
H  -5.855794 -0.547699 0.520813
