program: Gaussian 09
title: 000023039
version: EM64L-G09RevD.01
frameworkgroup: C1[X(C21H20N2O3)]
method: RPBEPBE
basis: SDD
operation: Freq
keyword: #p
keyword: freq=noraman
keyword: PBEPBE/SDD
title: #p freq=noraman PBEPBE/SDD
converged: YES YES NO NO
title: Mulliken charges:
elementType: O O O N N C C C C C C C C C C C C C C C C C C C C C H H H H H H H H H H H H H H H H H H H H
charge: -0.218297 -0.290830 -0.262896 -0.154469 -0.103367 -0.116166 -0.151969 -0.508642 -0.560422 -0.051122 0.339915 0.202355 -0.238492 -0.741694 -0.280373 -0.223223 0.238450 -0.344752 0.094869 0.217518 -0.031856 -0.402898 -0.355655 -0.257239 -0.226002 -0.496731 0.277109 0.258031 0.243795 0.254328 0.328276 0.243384 0.232941 0.232818 0.217288 0.251031 0.284880 0.231527 0.236630 0.226566 0.247838 0.218140 0.218375 0.237347 0.238369 0.245315
chargesum: 0.00000
title: Mulliken charges with hydrogens summed into heavy atoms:
elementType: O O O N N C C C C C C C C C C C C C C C C C C C C C
charge: -0.218297 -0.290830 -0.262896 -0.154469 -0.103367 0.160943 0.106063 -0.010519 0.011238 0.181819 0.339915 0.202355 -0.238492 -0.040557 0.004507 0.008304 0.238450 -0.108122 0.094869 0.217518 -0.031856 -0.176332 -0.107818 -0.039098 -0.007627 0.224300
polarizability: 3.91403098e+02 5.28989889e+01 2.94060954e+02 4.83162071e+00 -1.80912457e+01 1.33504992e+02
1716.lowfreq: -5.4268 0.0004 0.0006 0.0008 3.7352 6.9442 26.9542 38.1126 53.9790
frequency: 26.8872 38.1053 53.9686 64.9947 78.6248 89.0602 94.4895 119.0746 125.9909 151.1372 175.4722 187.5999 196.4174 218.0899 243.4922 267.2897 276.8637 292.1159 302.0806 314.0178 325.0598 333.8537 357.3526 436.5464 443.2173 448.8583 465.2952 484.1676 503.2694 524.1560 539.8646 548.2861 562.9611 573.5103 584.0937 593.4801 610.2060 651.6008 700.2816 718.8953 733.5822 736.1594 740.6454 761.2380 763.8958 783.6619 792.6103 820.4285 834.2710 861.7138 873.5205 905.5119 917.8145 920.2364 923.4478 927.4651 944.3834 946.8616 978.1749 997.2484 1001.1689 1033.9272 1047.1315 1054.7901 1064.0419 1089.6117 1109.3377 1114.7816 1123.9169 1132.8024 1146.2041 1147.1605 1162.0775 1162.7368 1175.9427 1184.4812 1210.9644 1218.4774 1230.6090 1246.5099 1258.3991 1268.3670 1272.7719 1296.0533 1298.2552 1317.0188 1320.5390 1325.7730 1332.0760 1338.7282 1345.9472 1363.1395 1365.1386 1374.3242 1398.8322 1423.6604 1425.0873 1448.2596 1451.4845 1464.0241 1464.7799 1468.0791 1473.3419 1478.1730 1486.6311 1506.5342 1527.7072 1582.2630 1590.2812 1593.9652 1628.1890 1629.3931 2950.8417 2965.6326 2972.2239 2978.6450 2993.5681 2994.7407 3005.0277 3056.6781 3091.9023 3095.3002 3102.6170 3107.0165 3114.9368 3126.0241 3147.6403 3150.0217 3150.2236 3161.2209 3175.8283 3187.2767
redmass: 5.0813 4.8610 4.4201 4.4812 2.2069 1.6935 3.6114 4.0712 3.7327 3.5254 3.0565 2.7005 5.0353 1.3117 4.0488 2.6502 4.4139 4.5660 5.6540 4.8722 4.3975 5.0114 3.9892 5.3628 3.1291 3.0602 3.8577 5.0272 3.2832 3.9425 4.1257 6.7544 5.1201 3.7717 4.5787 4.8443 6.0758 5.7330 6.4828 6.8262 1.6132 5.0547 2.3458 5.1658 1.9504 3.1151 2.7428 2.6074 6.2188 1.5819 5.0503 5.3469 1.3780 2.2630 1.7633 1.4281 1.3802 3.0093 1.3110 3.0167 2.2203 3.0229 3.7093 3.6140 2.2772 2.8339 1.9724 1.2644 1.9223 1.8993 1.4880 2.0441 1.9847 1.3529 2.4098 1.6228 1.9556 1.6190 2.3160 1.8596 1.3858 2.3727 1.9589 1.3841 1.6808 1.3542 1.6631 2.1559 1.9026 1.6955 1.7548 1.8263 1.8641 2.4840 1.2458 1.7941 1.6965 1.7301 1.0537 1.0552 1.0537 1.1796 2.3243 1.1477 2.1104 2.6662 5.7426 6.5643 7.5058 9.1335 8.3989 7.9037 1.0813 1.0826 1.0677 1.0715 1.0802 1.0377 1.0295 1.0991 1.0996 1.0889 1.0997 1.1044 1.0858 1.0890 1.0945 1.1048 1.0896 1.0991 1.0940 1.0963
irintensity: 0.8525 0.3668 2.5955 1.3834 0.1940 0.2447 3.4915 0.9398 0.8850 0.2085 4.6751 0.3628 3.4091 1.5410 3.6473 1.5796 7.7737 5.6407 9.2145 1.8205 0.5513 1.9757 3.6245 3.2110 4.7844 16.4014 4.3258 5.6581 2.9291 0.9082 7.3827 1.6353 1.9906 0.3107 5.1615 1.7295 0.5696 2.0422 13.2297 14.7915 40.2356 16.8690 43.6752 16.7412 49.2646 0.4635 8.4351 6.4893 1.9961 1.0102 14.4224 7.9174 2.7020 1.2046 3.2954 17.5363 1.4316 2.6498 0.2965 16.8238 14.5608 77.5826 163.2207 58.3998 36.7559 52.4043 5.0370 0.2594 7.5840 6.0707 75.9020 13.0287 26.4137 2.1698 77.0013 11.0579 3.1219 80.7238 14.5723 9.3953 5.2552 5.1759 109.5200 2.0158 38.6255 40.4893 41.8354 23.0980 14.7020 13.7104 4.6965 6.8003 53.5567 55.9018 30.3441 26.7898 9.3443 3.0147 13.8217 17.5754 7.1086 21.2064 53.8428 8.3621 13.8378 18.1440 6.7005 2.8555 101.8423 323.9882 199.6509 31.2284 4.5088 17.2077 24.1433 4.1661 46.0858 16.0069 34.9775 20.7121 22.6169 7.3197 22.1888 24.8203 2.5290 13.6513 34.5125 12.9247 10.0142 48.8419 0.0880 4.7741
temp: 298.150 k
press: 1.00000 atm
elementType: 8 8 8 7 7 6 6 6 6 6 6 6 6 6 6 6 6 6 6 6 6 6 6 6 6 6 1 1 1 1 1 1 1 1 1 1 1 1 1 1 1 1 1 1 1 1
symmnumber: 1
zpe: 960510.7 jmol-1
zpe.correction: 0.365839 hartree
zpe.thermalcorrener: 0.387733 hartree
zpe.thermalcorrenthalpy: 0.388677 hartree
zpe.thermalcorrgfe: 0.314625 hartree
zpe.sumelectzpe: -1145.551333 hartree
zpe.sumelectthermal: -1145.529439 hartree
zpe.sumelectthermalent: -1145.528495 hartree
zpe.sumelectthermalfe: -1145.602547 hartree
dipole: -2.9470 -6.0004 2.4441
dipole: 7.1179
quadrupole: -164.4116 -131.0579 -154.0736
quadrupole: 10.4914 -4.2097 0.7543
quadrupole: -14.5639 18.7898 -4.2259 10.4914 -4.2097 0.7543
hfenergy: -1145.917172 hartree
pointgroup: C01 [X(C21H20N2O3)]
dipole: -1.1348068 2.3909324 -0.9153 debye
polarizability: 390.2750433|-53.8094623|295.8209337|-6.1390211|-14.8915455|132.8730666 unknown
InChI: InChI=1S/C21H20N2O3/c1-12-16-10-23-8-7-14-13-5-3-4-6-18(13)22-20(14)19(23)9-15(16)17(11-26-12)21(24)25-2/h3-8,11-12,15-16H,9-10H2,1-2H3
charge 0 multiplicity 1
46 atoms
O  -4.819569 0.993105 0.614218
O  -2.207461 -2.77868 -0.838464
O  -4.180087 -3.164169 0.345861
N  0.011388 1.904098 -0.274999
N  2.100615 -1.089909 0.334638
C  -2.429534 1.459479 0.1950
C  -2.174724 0.017384 -0.326368
C  -1.393172 2.409938 -0.417784
C  -0.814823 -0.427257 0.260011
C  -3.872836 1.91556 -0.098009
C  0.286067 0.576875 0.0088
C  -3.343502 -0.882165 0.056051
C  1.641719 0.184445 0.068109
C  -4.241804 3.318268 0.381639
C  -4.515983 -0.353982 0.535855
C  1.021342 2.848091 -0.505291
C  2.720654 1.159429 -0.170465
C  2.371619 2.497971 -0.455285
C  -3.318433 -2.35602 -0.090114
C  3.930409 0.402356 -0.033326
C  3.491397 -0.959773 0.272527
C  5.315639 0.709817 -0.135141
C  4.458964 -1.985707 0.469224
C  6.249001 -0.319146 0.062931
C  5.818557 -1.655589 0.362637
C  -2.101652 -4.241252 -1.051611
H  -2.306457 1.453046 1.298071
H  -2.074638 0.043525 -1.432878
H  -1.597499 2.552662 -1.498537
H  -1.432505 3.398955 0.070426
H  -0.487979 -1.39182 -0.156298
H  -0.912199 -0.591423 1.353181
H  -4.087747 1.798444 -1.181722
H  -3.973091 3.456162 1.443751
H  -3.730535 4.090595 -0.219862
H  -5.328949 3.472931 0.278637
H  -5.337573 -0.983142 0.890223
H  0.678611 3.861909 -0.720892
H  3.1217 3.273844 -0.637003
H  5.653682 1.72813 -0.362604
H  4.13144 -3.004699 0.698837
H  7.321746 -0.107367 -0.009891
H  6.576883 -2.433746 0.511421
H  -1.15959 -4.375505 -1.601168
H  -2.962965 -4.603697 -1.637786
H  -2.076428 -4.76777 -0.083156
