program: Gaussian 09
title: 000269144
version: EM64L-G09RevD.01
frameworkgroup: C1[X(C17H14N2O)]
method: RPBEPBE
basis: SDD
operation: Freq
keyword: #p
keyword: freq=noraman
keyword: PBEPBE/SDD
title: #p freq=noraman PBEPBE/SDD
converged: YES YES NO NO
title: Mulliken charges:
elementType: O N N C C C C C C C C C C C C C C C C C H H H H H H H H H H H H H H
charge: -0.255102 -0.010076 -0.438807 0.358266 0.358123 0.420660 -0.455323 -0.074544 -0.394064 -0.377918 -0.541235 0.484224 -0.366661 -0.465186 -0.405555 -0.306315 -0.247777 -0.223901 0.213101 -0.799592 0.254618 0.238764 0.242040 0.250878 0.308647 0.219068 0.235962 0.260844 0.229507 0.231666 0.310224 0.237893 0.270434 0.237136
chargesum: 0.00000
title: Mulliken charges with hydrogens summed into heavy atoms:
elementType: O N N C C C C C C C C C C C C C C C C C
charge: -0.255102 -0.010076 -0.128583 0.358266 0.358123 0.420660 -0.200705 -0.074544 -0.155300 -0.135878 -0.290356 0.484224 -0.058013 -0.246118 -0.169593 -0.045471 -0.018270 0.007765 0.213101 -0.054129
polarizability: 4.20193448e+02 -1.54958125e+01 1.91115225e+02 -5.84658374e-01 4.94473259e-01 9.13007072e+01
1716.lowfreq: -86.4499 -3.8558 -0.8242 -0.0007 -0.0004 0.0006 6.0162 32.8010 42.0284
frequency: -86.4317 32.7865 42.0265 56.6368 78.3238 88.1340 136.6728 170.9506 185.7065 204.2322 236.9796 298.6138 348.0821 365.7994 370.4361 410.9285 420.9640 459.8395 479.5827 514.2335 518.8144 521.4651 556.0684 583.0757 593.7526 615.4797 637.6068 643.5246 659.9657 691.9859 738.2894 752.7721 764.7815 799.3350 821.5604 827.6314 856.4886 867.0234 875.8085 918.0974 929.3493 934.1159 938.3420 951.4679 969.7910 984.6313 992.6288 995.7386 1004.8617 1016.3684 1030.6382 1039.2630 1118.8728 1128.9728 1164.1004 1197.1333 1205.4917 1220.1058 1230.3617 1254.4730 1267.1176 1302.2416 1308.9658 1339.3237 1363.8905 1371.3815 1376.4034 1392.8042 1417.5005 1429.2048 1447.5837 1453.8124 1467.9370 1482.1810 1498.2876 1516.4033 1555.4576 1583.1807 1596.4639 1619.8829 1627.4792 1635.2791 2987.9532 3072.9662 3110.6291 3114.4358 3120.2862 3128.8209 3137.0574 3137.1536 3138.7195 3150.8901 3154.8961 3170.6398 3195.3987 3519.5202
redmass: 1.0452 4.9850 5.1077 4.9360 4.4144 4.5986 5.0980 5.3852 3.8145 5.8676 4.8663 5.3495 4.5801 4.0529 4.8799 2.9880 3.8971 4.0222 2.9730 3.6032 6.7642 4.9774 3.0736 2.9048 5.7171 7.5485 6.5000 1.1841 2.8943 6.3354 3.2750 5.0801 1.3949 2.6806 4.6288 1.4381 2.6356 1.9552 1.5470 1.7412 4.8526 3.6679 1.8105 1.3908 1.3923 1.6865 1.3336 1.3303 3.1670 2.2039 1.6619 2.4677 1.7176 1.3787 1.1485 1.1808 1.9514 3.0684 1.7846 2.0174 1.9160 2.0918 1.4184 2.7852 4.7018 2.1158 1.2516 3.0614 4.0030 4.1504 1.2017 2.3693 1.0471 2.7552 2.2430 3.1201 7.1832 4.9213 5.8199 6.1591 6.0792 5.4395 1.0384 1.0984 1.0888 1.0906 1.0875 1.0918 1.0979 1.0891 1.0902 1.0947 1.0948 1.0995 1.0947 1.0764
irintensity: 0.0236 0.0347 9.4415 1.8154 3.5072 0.5615 1.9990 3.8178 0.5090 0.1065 1.9710 1.9652 1.2311 0.8469 5.6067 0.7967 1.9867 4.4616 7.6444 13.4015 1.0670 4.6829 18.9963 2.1185 12.2773 1.2325 0.8467 61.5902 1.3069 5.2788 2.6010 1.6975 53.5785 9.1709 1.4068 55.8199 18.4224 49.9122 1.4891 15.9809 1.5612 18.7689 0.7719 1.5018 7.3841 30.8043 5.2843 0.0928 3.6111 8.7038 7.9929 1.9839 10.1140 12.0710 1.9591 18.0144 1.0224 87.1422 5.6405 0.3024 44.2202 10.7235 26.5214 134.5238 15.0506 60.6461 69.4037 54.2759 34.0590 71.2196 42.2730 19.7934 20.4695 97.0366 134.1205 291.2393 8.6869 70.4689 1.0805 31.3817 51.8501 112.9739 9.3904 15.0869 41.2965 5.8569 2.3291 12.7993 7.1366 8.9731 12.2691 8.9189 24.6811 31.4919 5.2210 13.2002
temp: 298.150 k
press: 1.00000 atm
elementType: 8 7 7 6 6 6 6 6 6 6 6 6 6 6 6 6 6 6 6 6 1 1 1 1 1 1 1 1 1 1 1 1 1 1
symmnumber: 1
zpe: 697681.9 jmol-1
zpe.correction: 0.265733 hartree
zpe.thermalcorrener: 0.281439 hartree
zpe.thermalcorrenthalpy: 0.282384 hartree
zpe.thermalcorrgfe: 0.221385 hartree
zpe.sumelectzpe: -839.594091 hartree
zpe.sumelectthermal: -839.578384 hartree
zpe.sumelectthermalent: -839.577440 hartree
zpe.sumelectthermalfe: -839.638439 hartree
dipole: -2.2688 1.3571 1.8008
dipole: 3.1988
quadrupole: -89.9491 -113.8376 -121.8030
quadrupole: -28.4532 -5.1183 0.3963
quadrupole: 18.5808 -5.3077 -13.2731 -28.4532 -5.1183 0.3963
hfenergy: -839.8598238 hartree
pointgroup: C01 [X(C17H14N2O1)]
dipole: 0.8919226 0.5337443 -0.7094982 debye
polarizability: 420.1371567|15.9080717|191.1687999|-0.5035537|-0.741129|91.3034228 unknown
InChI: InChI=1S/C17H14N2O/c1-12(20)19-16-8-6-13(7-9-16)15-10-14-4-2-3-5-17(14)18-11-15/h2-11,19H,1H3
charge 0 multiplicity 1
34 atoms
O  5.418986 -1.759577 0.491552
N  -3.017242 1.730198 0.436388
N  4.796773 0.397872 -0.200322
C  -0.969736 0.399001 0.041463
C  0.514527 0.383569 -0.012968
C  -3.173881 -0.68082 -0.137855
C  -1.746958 -0.74351 -0.206856
C  -3.781764 0.594766 0.184346
C  1.256658 -0.77289 0.352767
C  1.248545 1.526919 -0.434994
C  -1.68139 1.613899 0.367176
C  3.377227 0.343011 -0.12219
C  2.66256 -0.809869 0.302817
C  2.652513 1.509369 -0.48926
C  -4.02061 -1.810822 -0.38471
C  -5.206314 0.699683 0.249794
C  -5.409798 -1.68235 -0.313967
C  -6.006755 -0.41976 0.004792
C  5.73293 -0.600883 0.093087
C  7.183005 -0.161254 -0.11385
H  -1.268493 -1.690389 -0.484074
H  0.725269 -1.660212 0.715329
H  0.716677 2.429554 -0.754223
H  -1.112782 2.52199 0.604517
H  3.216196 -1.703774 0.594225
H  3.191067 2.403917 -0.828584
H  -3.563283 -2.777279 -0.629618
H  -5.633724 1.676475 0.496581
H  -6.05139 -2.549984 -0.503058
H  -7.097862 -0.336119 0.055821
H  5.181163 1.292767 -0.514094
H  7.371807 0.1192 -1.166832
H  7.842805 -0.999499 0.15109
H  7.43697 0.705696 0.524011
