program: Gaussian 09
title: 000269155
version: EM64L-G09RevD.01
frameworkgroup: C1[X(C17H13BrClN)]
method: RPBEPBE
basis: SDD
operation: Freq
keyword: #p
keyword: freq=noraman
keyword: PBEPBE/SDD
title: #p freq=noraman PBEPBE/SDD
converged: YES YES NO NO
title: Mulliken charges:
elementType: Br Cl N C C C C C C C C C C C C C C C C C H H H H H H H H H H H H H
charge: 0.008724 -0.042961 0.074323 0.531592 -0.725174 0.275646 -0.634630 -0.083968 0.364690 0.515655 -0.360585 -0.320207 -0.292055 -0.809228 -0.442577 -0.369412 -0.312894 -0.174926 -0.179385 -0.227411 0.230687 0.234536 0.249558 0.251128 0.267681 0.259499 0.241083 0.238271 0.240222 0.240329 0.249131 0.251532 0.251125
chargesum: 0.00000
title: Mulliken charges with hydrogens summed into heavy atoms:
elementType: Br Cl N C C C C C C C C C C C C C C C C C
charge: 0.008724 -0.042961 0.074323 0.531592 -0.259951 0.275646 -0.385072 -0.083968 0.364690 0.515655 -0.109456 -0.052526 -0.032556 -0.089653 -0.202248 -0.120281 -0.312894 0.076606 0.071740 -0.227411
polarizability: 3.58926844e+02 -5.39724049e+00 1.76512195e+02 -3.22510800e+01 -1.77486914e+00 1.47686228e+02
1716.lowfreq: -9.7278 -4.5122 -2.6993 -0.0022 -0.0022 -0.0014 12.2898 17.9436 26.5202
frequency: 12.2141 17.6805 26.4365 66.4603 97.8741 145.9181 147.8892 151.2962 173.8654 189.5815 208.4990 233.9884 261.3502 293.1936 301.3277 338.4055 354.7819 389.7392 406.9311 425.8311 475.2877 495.4950 513.8863 520.1653 528.0116 565.1989 580.3232 624.2013 630.5545 673.9214 702.6477 727.1054 769.8431 788.3833 802.0524 823.4241 835.4265 856.1686 866.6134 867.3204 899.2147 908.1774 945.8541 968.4265 974.3492 985.0026 989.0823 996.3460 1044.3682 1061.2814 1067.3928 1094.4530 1109.5871 1149.6031 1186.7725 1189.8598 1193.9580 1216.8882 1255.3697 1272.8807 1286.2694 1295.1330 1306.8669 1341.1019 1372.9924 1390.5892 1394.6661 1401.6526 1414.5399 1456.7166 1458.9528 1468.6700 1472.5298 1474.0199 1510.1182 1555.6643 1577.6260 1581.1793 1597.4240 1629.2063 2972.2442 2980.0707 3019.1796 3057.2767 3097.6300 3127.1805 3131.1191 3133.8029 3134.6491 3166.9759 3170.0071 3170.5566 3173.2662
redmass: 5.8730 6.0132 5.4584 7.9271 7.9637 2.9565 1.6873 5.9520 2.8875 5.0665 3.5786 3.9754 5.5355 4.6544 10.1248 2.9535 3.8616 7.5264 2.8702 3.2650 3.7572 4.0367 4.5306 5.9547 3.2575 4.7506 5.7108 6.5749 5.3314 4.0937 4.2828 4.4168 3.5017 3.2836 4.1007 1.5141 1.2495 1.8052 4.0176 1.5180 1.8324 2.6088 1.6203 1.6263 1.4249 1.7917 1.3805 4.9544 1.5682 2.6098 2.5591 2.1965 1.3920 1.3719 1.1203 1.1423 2.5924 1.9687 1.9585 2.3373 1.5115 3.5263 1.5978 2.3469 6.0712 3.1078 2.4615 1.5674 2.9770 1.9070 1.5674 1.0483 1.3095 1.9449 4.0572 8.2379 6.2293 7.0361 6.1314 6.5852 1.0597 1.0380 1.1003 1.0972 1.0984 1.0899 1.0904 1.0897 1.0897 1.0949 1.0960 1.0960 1.0936
irintensity: 0.1073 0.0949 0.6826 0.0727 0.0884 1.2791 0.5528 1.4726 0.3142 1.0173 1.5883 0.2966 0.7570 2.8277 11.9033 3.8833 3.4169 5.4812 0.2687 3.5740 12.8439 14.3855 11.9980 3.0151 5.2915 8.7278 11.6386 0.9498 3.1096 1.7195 1.0371 0.9379 33.1868 4.4424 28.1868 61.8533 0.2886 25.7386 49.1430 19.8908 8.1442 11.9501 10.2406 5.3873 0.7982 10.6032 0.1830 70.7676 6.0684 28.7872 3.5453 50.3082 12.4473 19.6077 1.5890 5.4313 11.8011 2.4535 5.9029 34.8608 2.3251 40.2877 2.3106 13.1678 0.4116 2.3918 8.9460 25.9853 26.7197 26.6782 11.2906 14.8204 100.9978 43.0839 18.8975 106.1530 86.8566 16.3982 5.9346 5.0229 23.9923 17.2610 9.8436 13.5597 20.6599 10.6777 10.4154 10.8837 9.2298 9.3639 0.5549 5.8683 2.5851
temp: 298.150 k
press: 1.00000 atm
elementType: 35 17 7 6 6 6 6 6 6 6 6 6 6 6 6 6 6 6 6 6 1 1 1 1 1 1 1 1 1 1 1 1 1
symmnumber: 1
zpe: 650278.3 jmol-1
zpe.correction: 0.247678 hartree
zpe.thermalcorrener: 0.265272 hartree
zpe.thermalcorrenthalpy: 0.266216 hartree
zpe.thermalcorrgfe: 0.198160 hartree
zpe.sumelectzpe: -1182.517338 hartree
zpe.sumelectthermal: -1182.499744 hartree
zpe.sumelectthermalent: -1182.498799 hartree
zpe.sumelectthermalfe: -1182.566856 hartree
dipole: -0.7681 4.9286 -0.6480
dipole: 5.0300
quadrupole: -157.7506 -130.7009 -126.5734
quadrupole: 15.3300 -13.8095 0.4481
quadrupole: -19.4090 7.6408 11.7682 15.3300 -13.8095 0.4481
hfenergy: -1182.7650158 hartree
pointgroup: C01 [X(C17H13Br1Cl1N1)]
dipole: -0.4571353 -0.6835159 -1.8000283 debye
polarizability: 355.0542474|-42.9384051|154.9268198|2.4166816|9.9306458|173.1442004 unknown
InChI: InChI=1S/C17H13BrClN/c1-11-8-17(19)20-16-7-4-13(10-15(11)16)9-12-2-5-14(18)6-3-12/h2-8,10H,9H2,1H3
charge 0 multiplicity 1
33 atoms
Br -6.771692 0.051524 1.874132
Cl 6.012211 -0.128478 1.940163
N  3.481027 0.607242 1.309701
C  -0.18479 0.406289 -0.829971
C  -1.500433 0.398084 -1.602816
C  2.097374 -0.46918 -0.454049
C  0.842935 -0.492487 -1.143283
C  2.292376 0.513405 0.591278
C  3.186035 -1.377413 -0.749759
C  -2.758529 0.336459 -0.736961
C  0.027604 1.368404 0.213927
C  1.236629 1.423042 0.907062
C  4.366907 -1.253471 -0.008552
C  3.05951 -2.432615 -1.827948
C  -3.863678 1.179671 -1.0089
C  -2.865811 -0.59002 0.331874
C  4.439343 -0.243406 0.999059
C  -5.052454 1.104341 -0.246693
C  -4.043527 -0.682381 1.105357
C  -5.127248 0.168624 0.803735
H  -1.555085 1.305407 -2.237118
H  -1.497054 -0.462684 -2.300876
H  0.682534 -1.229428 -1.938995
H  -0.780121 2.064736 0.467307
H  1.415657 2.151899 1.702893
H  5.222431 -1.909177 -0.187209
H  2.862131 -1.97576 -2.815937
H  3.981721 -3.03074 -1.908714
H  2.222527 -3.124118 -1.616153
H  -3.804053 1.908488 -1.82628
H  -2.018993 -1.243779 0.570518
H  -5.897448 1.762618 -0.467846
H  -4.113736 -1.401295 1.926757
