program: Gaussian 09
title: 000269143
version: EM64L-G09RevD.01
frameworkgroup: C1[X(C15H10N2O3)]
method: RPBEPBE
basis: SDD
operation: Freq
keyword: #p
keyword: freq=noraman
keyword: PBEPBE/SDD
title: #p freq=noraman PBEPBE/SDD
converged: NO YES NO NO
title: Mulliken charges:
elementType: O O O N N C C C C C C C C C C C C C C C H H H H H H H H H H
charge: -0.327704 -0.207141 -0.206257 -0.040053 0.026153 0.369586 0.403611 0.170821 -0.472050 0.350217 -0.433358 -0.394658 -0.355305 -0.367252 -0.358422 -0.242968 -0.209705 -0.375467 -0.370014 0.380305 0.260358 0.296088 0.241088 0.300815 0.252429 0.254307 0.236980 0.240472 0.288068 0.289056
chargesum: 0.00000
title: Mulliken charges with hydrogens summed into heavy atoms:
elementType: O O O N N C C C C C C C C C C C C C C C
charge: -0.327704 -0.207141 -0.206257 -0.040053 0.026153 0.369586 0.403611 0.170821 -0.211692 0.350217 -0.137270 -0.153570 -0.054490 -0.114823 -0.104115 -0.005988 0.030767 -0.087399 -0.080958 0.380305
polarizability: 4.01677453e+02 -9.09536542e+00 2.01073380e+02 5.71014260e-01 5.39926953e+00 8.03755326e+01
1716.lowfreq: -4.3872 0.0002 0.0003 0.0005 2.5305 6.6399 36.4511 40.9440 64.7112
frequency: 36.4499 40.9406 64.7061 74.4611 111.3737 151.5375 185.8364 204.6813 212.1472 255.1315 296.8029 325.8357 358.3049 411.5148 426.5692 429.2065 467.6102 490.7326 508.5402 525.7609 534.5835 583.7602 597.3572 615.0503 627.6866 644.9119 670.7295 678.0550 740.0318 745.3073 754.3335 775.1524 786.6759 848.1854 849.9487 853.1664 859.8889 876.8091 894.0650 911.8244 977.5678 989.6999 995.2446 1002.4787 1004.2543 1017.9049 1052.2379 1083.8785 1095.6468 1116.2194 1156.3274 1165.6337 1186.5031 1206.6251 1220.4308 1226.9756 1260.3105 1294.0366 1301.4755 1333.3542 1338.2659 1365.8378 1395.2762 1411.0716 1419.2904 1432.6886 1451.5964 1489.8386 1502.8784 1568.3976 1579.3773 1591.5737 1608.4447 1622.4784 3133.5383 3148.8662 3150.4084 3152.9266 3158.7151 3165.9830 3183.3570 3185.8653 3186.3473 3202.9629
redmass: 7.2875 7.7230 6.5735 5.3844 6.0156 6.5345 5.2398 9.4932 6.3258 5.2495 5.6519 6.0066 6.0026 2.9376 8.2951 3.3704 4.1234 6.1427 7.3013 3.4312 7.2571 6.0127 6.2164 4.8570 5.3767 3.3498 4.1792 8.4279 3.8973 4.1449 3.2467 1.4896 9.0877 2.6794 1.3289 1.7755 1.4149 1.7472 1.6381 5.2388 1.3651 1.3389 1.3783 1.3215 3.1116 2.2991 2.5441 2.8208 3.0553 1.3142 1.6791 1.2329 1.5262 2.9760 3.1372 1.6725 1.8584 2.5688 1.2911 2.2881 4.1704 6.1697 6.0775 3.9649 5.0199 3.5886 2.3234 2.8120 4.5478 5.1100 6.9436 7.9554 6.2255 6.8792 1.0870 1.0913 1.0901 1.0901 1.0915 1.0966 1.0948 1.0960 1.0965 1.0923
irintensity: 0.2440 1.6545 1.4168 0.4209 4.2452 0.3396 1.5838 0.1147 1.6284 1.2456 2.7887 1.9358 1.1123 0.0381 3.6819 3.8574 4.8284 1.4300 0.3560 10.4578 10.9702 0.8740 1.5490 6.9283 0.4808 0.9797 22.1361 4.0494 0.7871 0.7948 6.9132 58.6537 41.7245 24.7272 46.1964 50.1814 3.3012 17.2806 7.0943 19.3351 4.4932 3.6865 0.7449 1.0719 1.3817 7.1724 0.3274 15.7608 26.6092 16.1323 5.4375 5.9654 157.6000 48.2742 434.3944 44.3881 0.2259 13.7855 0.5518 4.6169 15.8153 137.7133 8.6977 6.1047 8.0871 29.1529 3.1872 23.7790 25.4682 11.9854 26.1307 2.7325 130.5871 6.0782 0.8381 13.2205 5.4593 6.0678 2.6494 20.4173 0.0378 4.2960 10.3665 1.0100
temp: 298.150 k
press: 1.00000 atm
elementType: 8 8 8 7 7 6 6 6 6 6 6 6 6 6 6 6 6 6 6 6 1 1 1 1 1 1 1 1 1 1
symmnumber: 1
zpe: 571566.5 jmol-1
zpe.correction: 0.217698 hartree
zpe.thermalcorrener: 0.232928 hartree
zpe.thermalcorrenthalpy: 0.233873 hartree
zpe.thermalcorrgfe: 0.173991 hartree
zpe.sumelectzpe: -911.288214 hartree
zpe.sumelectthermal: -911.272984 hartree
zpe.sumelectthermalent: -911.272040 hartree
zpe.sumelectthermalfe: -911.331922 hartree
dipole: 5.2003 -3.4241 0.5369
dipole: 6.2495
quadrupole: -142.4853 -113.0479 -117.4651
quadrupole: -16.2441 2.4619 1.9179
quadrupole: -18.1525 11.2849 6.8676 -16.2441 2.4619 1.9179
hfenergy: -911.5059126 hartree
pointgroup: C01[X(C15H10N2O3)]
dipole: 2.0482118 -1.3454686 0.1999624 debye
polarizability: 401.7046513|-8.7947062|200.9719864|0.1047585|6.191672|80.4497275 unknown
InChI: InChI=1S/C15H10N2O3/c18-16-10-13(9-12-3-1-2-4-15(12)16)11-5-7-14(8-6-11)17(19)20/h1-10H
charge 0 multiplicity 1
30 atoms
O  2.943365 2.76671 -0.413509
O  -5.92771 -1.26641 -0.421449
O  -6.041761 0.817014 0.50229
N  2.392605 1.567957 -0.235886
N  -5.379566 -0.187862 0.032409
C  0.402804 0.148659 -0.033223
C  2.630685 -0.868759 0.123098
C  3.233279 0.423382 -0.064095
C  1.206425 -0.993411 0.1350
C  -1.083726 0.069346 -0.019304
C  1.028048 1.414275 -0.217882
C  3.510451 -1.987722 0.297104
C  4.639907 0.598276 -0.083982
C  -1.751076 -1.086946 -0.515305
C  -1.871691 1.140214 0.491076
C  4.897413 -1.817538 0.277853
C  5.465913 -0.520046 0.085863
C  -3.153139 -1.181174 -0.500455
C  -3.275503 1.06519 0.511064
C  -3.900572 -0.099064 0.014219
H  0.756053 -1.973927 0.3154
H  0.47532 2.337524 -0.395022
H  3.074719 -2.982396 0.444895
H  5.032563 1.607186 -0.232373
H  -1.166318 -1.905769 -0.94633
H  -1.380853 2.02628 0.906236
H  5.556365 -2.68198 0.411013
H  6.554143 -0.400468 0.072731
H  -3.676448 -2.060108 -0.885459
H  -3.890197 1.877367 0.907524
