program: Gaussian 09
title: 000269151
version: EM64L-G09RevD.01
frameworkgroup: C1[X(C17H13BrClN)]
method: RPBEPBE
basis: SDD
operation: Freq
keyword: #p
keyword: freq=noraman
keyword: PBEPBE/SDD
title: #p freq=noraman PBEPBE/SDD
converged: YES YES NO NO
title: Mulliken charges:
elementType: Br Cl N C C C C C C C C C C C C C C C C C H H H H H H H H H H H H H
charge: 0.006317 -0.051997 -0.025469 0.526606 -0.722818 0.476511 -0.588803 -0.134079 0.516626 -0.356997 -0.322371 -0.200237 0.143865 -0.303120 -0.368190 -0.443627 -0.179555 -0.175168 -0.782699 -0.226531 0.229510 0.237653 0.260022 0.248610 0.265485 0.260087 0.250087 0.240290 0.250733 0.250997 0.256074 0.231025 0.231165
chargesum: 0.00000
title: Mulliken charges with hydrogens summed into heavy atoms:
elementType: Br Cl N C C C C C C C C C C C C C C C C C
charge: 0.006317 -0.051997 -0.025469 0.526606 -0.255655 0.476511 -0.328782 -0.134079 0.516626 -0.108387 -0.056887 -0.200237 0.143865 -0.043033 -0.118103 -0.203338 0.071178 0.075828 -0.064435 -0.226531
polarizability: 3.47132728e+02 6.12419116e-01 1.81652802e+02 3.12215447e+01 1.92250433e+00 1.51773493e+02
1716.lowfreq: -6.9142 -1.7005 -0.0021 -0.0013 -0.0012 1.2878 13.4199 19.7439 27.4857
frequency: 13.0416 19.5518 27.4275 69.8973 83.9841 100.2442 134.7826 136.5884 174.3178 189.1354 210.9226 234.1338 258.7863 287.4548 315.4251 339.0169 365.0867 382.3566 407.8775 420.2744 458.6031 487.9315 499.5168 528.5975 532.6429 583.3625 610.0140 623.1629 630.8117 667.0856 698.8343 727.8831 782.2336 788.2503 804.5026 824.4506 835.8083 839.5673 856.5336 873.8725 905.0081 925.3583 947.3968 966.7540 973.6672 977.3551 988.9155 996.1801 1005.4996 1045.4121 1060.5631 1108.8508 1123.7835 1149.1803 1185.1306 1188.3963 1196.4257 1214.1629 1254.5233 1268.2814 1285.8751 1294.2270 1307.5026 1351.4524 1373.1584 1377.7715 1389.3549 1390.4885 1394.9463 1455.3642 1458.6929 1464.5590 1467.2771 1473.5062 1490.5999 1542.1363 1580.9113 1588.4728 1597.1103 1631.8359 2975.6885 2983.4369 3023.1555 3060.8925 3120.7557 3127.5955 3132.4051 3134.9760 3138.3563 3167.4397 3168.4624 3169.5047 3170.6803
redmass: 8.6022 4.5918 5.7785 2.8875 1.2771 6.0898 6.8639 6.8411 4.2537 5.4642 6.1167 3.8074 5.4548 5.1115 7.0418 2.7776 4.2644 7.2573 2.8705 3.5279 4.2187 4.0342 3.3419 4.9631 4.0053 5.9375 5.7166 5.0147 5.3423 3.9648 4.3700 3.9481 3.4113 3.0629 6.2090 1.5944 1.2502 4.3899 1.7443 1.3648 1.5991 2.8105 1.7361 1.7949 1.5304 2.1148 1.3917 4.9384 1.8169 1.5683 2.5876 1.3929 1.8628 1.5286 1.1206 1.1215 2.1780 1.8785 1.9098 3.8678 1.4628 2.5467 1.6317 3.3387 6.2168 3.3400 4.2587 1.3025 2.4699 1.2272 1.4502 2.6256 1.0467 2.0888 2.7981 6.5649 7.2663 8.1520 6.1362 6.9447 1.0599 1.0384 1.1004 1.0972 1.0981 1.0899 1.0892 1.0896 1.0913 1.0950 1.0959 1.0936 1.0959
irintensity: 0.0645 0.0706 0.0400 1.5097 0.0745 0.1992 0.1931 0.9117 0.0878 2.5886 2.7634 1.4374 1.3856 1.6636 1.9422 0.4486 7.5842 3.6217 0.2961 2.9377 11.4947 4.7300 20.9771 1.5908 2.7088 2.2330 13.3392 3.6969 7.9763 6.0222 1.6509 7.2389 25.9609 3.1618 38.7213 72.1766 0.7667 9.8620 13.2584 22.8942 12.9298 12.0317 3.1640 3.9254 1.7056 4.3009 0.3118 71.2283 9.1863 5.8794 27.0365 11.0053 1.1770 18.4141 2.0524 3.9283 4.4312 0.0723 2.3791 21.6280 2.3316 15.4285 2.7389 9.7793 0.5423 9.7726 61.1236 23.9927 7.9166 19.9250 36.6152 35.7304 17.4697 81.1097 36.2424 34.4388 2.8466 114.7847 7.0306 1.9487 23.3645 21.8123 9.2219 17.1814 8.0601 10.6471 7.5650 8.8609 6.3537 8.8252 7.3923 0.6267 1.3597
temp: 298.150 k
press: 1.00000 atm
elementType: 35 17 7 6 6 6 6 6 6 6 6 6 6 6 6 6 6 6 6 6 1 1 1 1 1 1 1 1 1 1 1 1 1
symmnumber: 1
zpe: 649532.8 jmol-1
zpe.correction: 0.247394 hartree
zpe.thermalcorrener: 0.265125 hartree
zpe.thermalcorrenthalpy: 0.266069 hartree
zpe.thermalcorrgfe: 0.197630 hartree
zpe.sumelectzpe: -1182.516619 hartree
zpe.sumelectthermal: -1182.498888 hartree
zpe.sumelectthermalent: -1182.497944 hartree
zpe.sumelectthermalfe: -1182.566383 hartree
dipole: -1.7440 0.7950 0.8347
dipole: 2.0905
quadrupole: -131.9777 -135.6692 -127.1188
quadrupole: 4.4352 9.8556 3.9591
quadrupole: -0.3891 -4.0806 4.4698 4.4352 9.8556 3.9591
hfenergy: -1182.7640131 hartree
pointgroup: C01 [X(C17H13Br1Cl1N1)]
dipole: -0.6235147 -0.1247059 0.5216459 debye
polarizability: 343.2631541|-38.1597025|159.8128424|-11.2125954|15.1334709|177.4830265 unknown
InChI: InChI=1S/C17H13BrClN/c1-11-8-16(19)15-10-13(4-7-17(15)20-11)9-12-2-5-14(18)6-3-12/h2-8,10H,9H2,1H3
charge 0 multiplicity 1
33 atoms
Br 6.637081 0.21557 -1.917507
Cl -3.132803 2.374221 2.307817
N  -3.553881 -0.706382 -1.164123
C  0.148862 -0.516068 0.93013
C  1.481777 -0.514163 1.672428
C  -2.149624 0.320465 0.636698
C  -0.887826 0.343879 1.308135
C  -2.362428 -0.612047 -0.457465
C  2.71313 -0.359247 0.779902
C  -0.065593 -1.431215 -0.156172
C  -1.285609 -1.479582 -0.828282
C  -3.267919 1.157256 0.950763
C  -4.571994 0.109533 -0.820616
C  -4.462533 1.069718 0.249425
C  2.766329 0.644736 -0.220888
C  3.845151 -1.191662 0.958435
C  3.917452 0.822799 -1.018888
C  5.008284 -1.031148 0.169959
C  -5.86545 -0.002721 -1.598613
C  5.028912 -0.020507 -0.811075
H  1.580103 -1.456553 2.247314
H  1.469932 0.30205 2.421545
H  -0.743145 1.051004 2.132626
H  0.752142 -2.096018 -0.457799
H  -1.463755 -2.173492 -1.655167
H  -5.31234 1.711865 0.495144
H  1.897913 1.293216 -0.384073
H  3.827115 -1.978351 1.722409
H  3.946618 1.601616 -1.786367
H  5.875131 -1.681457 0.318045
H  -5.766532 -0.783381 -2.367852
H  -6.710637 -0.261703 -0.933658
H  -6.119166 0.95417 -2.09223
