program: Gaussian 09
title: 000269174
version: EM64L-G09RevD.01
frameworkgroup: C1[X(C19H16FNO2)]
method: RPBEPBE
basis: SDD
operation: Freq
keyword: #p
keyword: freq=noraman
keyword: PBEPBE/SDD
title: #p freq=noraman PBEPBE/SDD
converged: YES YES NO NO
title: Mulliken charges:
elementType: F O O N C C C C C C C C C C C C C C C C C C C H H H H H H H H H H H H H H H H
charge: -0.200177 -0.259234 -0.229997 -0.025339 0.209658 0.189560 0.259131 -0.083815 -0.113621 0.173121 -0.836354 -0.356018 -0.319811 0.077837 -0.255981 -0.232166 0.182929 -0.336760 -0.370911 -0.243681 -0.201723 -0.254457 -0.660538 0.234904 0.264186 0.265189 0.253748 0.265464 0.229766 0.233441 0.260219 0.255346 0.231767 0.235194 0.224444 0.238058 0.220355 0.244142 0.232122
chargesum: 0.00000
title: Mulliken charges with hydrogens summed into heavy atoms:
elementType: F O O N C C C C C C C C C C C C C C C C C C C
charge: -0.200177 -0.259234 -0.229997 -0.025339 0.209658 0.189560 0.259131 -0.083815 -0.113621 0.173121 -0.072075 -0.102270 -0.054348 0.077837 -0.026215 0.001276 0.182929 -0.076541 -0.115565 -0.011914 0.033472 0.208045 0.036081
polarizability: 3.12179206e+02 -3.50527069e+01 2.44410833e+02 -1.73866725e+01 -1.25054545e+01 1.37703716e+02
1716.lowfreq: -6.7190 -2.6458 0.0003 0.0003 0.0007 4.8075 26.3246 38.2294 44.0264
frequency: 26.1910 38.0903 43.9575 54.8504 69.0517 82.3076 87.7056 110.3811 127.0459 146.6020 175.6679 185.6276 203.1281 233.5057 240.1850 265.2858 305.7623 312.8574 322.8247 357.3395 375.8187 420.3913 437.5371 443.9369 456.6649 467.9834 506.1669 514.1711 548.4457 562.1834 575.9471 629.2110 632.1353 659.2119 701.3376 707.9624 716.0710 742.9119 764.2005 768.1806 775.6277 788.2838 801.5758 819.0165 826.7961 851.7804 866.6645 882.7793 931.6300 947.8685 968.2131 983.4429 996.7585 997.1383 1012.6936 1023.5715 1037.3343 1043.5663 1048.1262 1089.4235 1096.3756 1117.5716 1154.7058 1157.1769 1160.9998 1168.4813 1184.7761 1200.8630 1251.3429 1254.5799 1279.1556 1299.3221 1304.2057 1349.5118 1359.1993 1373.7425 1375.0325 1393.7715 1403.2299 1416.3628 1435.3652 1441.5803 1457.2753 1463.3728 1463.7408 1478.9646 1483.7880 1487.0152 1492.4483 1543.0885 1563.5302 1579.2082 1615.9877 1616.6982 1622.3377 2994.0908 2999.8159 3031.1548 3082.1060 3089.2979 3094.2277 3119.7943 3121.0195 3133.6359 3139.5049 3148.7470 3153.8824 3165.0984 3167.5342 3173.5806 3178.9591
redmass: 4.5077 4.6300 5.1494 3.4463 5.2907 3.8803 3.8670 1.3651 3.5698 2.6068 6.1544 5.7123 1.6284 3.2039 4.6614 4.1889 4.5530 3.1042 4.7356 3.8896 5.8097 3.9924 4.9759 4.6300 3.5917 3.4736 5.9438 4.6119 3.9327 5.5693 6.9624 5.5523 6.1201 5.7485 5.1951 4.5059 6.0479 3.6544 1.4543 2.9525 1.5739 3.2982 2.5935 2.1344 3.0262 2.7876 1.8716 1.6954 4.9978 1.3849 1.3665 1.3286 1.3301 3.6267 2.9196 2.2481 2.0289 2.1478 1.5286 2.3752 2.1719 2.2228 1.6725 2.1010 1.3644 1.1493 2.6618 2.0887 2.3147 1.6282 1.1186 3.5982 2.3210 1.7977 2.8172 2.9364 8.0199 1.2298 1.2050 5.3267 2.5623 2.9350 1.1330 1.2276 1.0581 2.8414 1.0544 1.1060 2.3735 7.3266 6.8116 6.6550 7.9758 7.9128 7.2327 1.0362 1.0390 1.0591 1.0958 1.0974 1.1035 1.1055 1.0988 1.0859 1.0859 1.0897 1.0907 1.0950 1.0955 1.1000 1.0999
irintensity: 0.4239 1.3114 0.2858 0.2161 0.8118 1.0868 0.6995 1.1329 3.4165 1.6113 2.6167 0.4124 2.6183 0.1440 1.2597 1.1159 1.9911 10.4273 3.6046 4.5638 2.6504 5.4928 2.9431 1.6754 1.9683 6.2176 12.3615 2.0472 3.8483 4.8806 1.7125 2.5983 11.2974 3.3168 5.2363 7.0831 0.6080 11.7492 57.5038 14.8051 98.1263 2.9099 8.6617 5.5638 6.6643 1.2558 2.3598 1.1281 41.1093 1.7357 0.7379 0.2603 0.5151 31.2121 53.5954 33.4879 6.0933 123.9356 6.2086 32.7497 21.5817 75.4010 31.5422 70.8237 35.6401 4.8542 50.6248 75.7417 8.6119 5.3138 4.5394 60.9204 6.9883 13.4264 41.5579 14.2409 1.7594 23.3831 9.5849 1.8454 40.1871 4.4714 11.6901 14.5385 15.5751 34.3922 14.1184 7.4338 26.3228 18.4429 19.0734 7.2679 99.7563 38.6433 16.3616 18.9093 11.6997 28.9151 10.9176 36.4746 1.0987 27.5995 5.8593 3.3841 1.6626 10.4593 12.8872 12.1821 10.7048 28.3933 13.2119
temp: 298.150 k
press: 1.00000 atm
elementType: 9 8 8 7 6 6 6 6 6 6 6 6 6 6 6 6 6 6 6 6 6 6 6 1 1 1 1 1 1 1 1 1 1 1 1 1 1 1 1
symmnumber: 1
zpe: 786834.1 jmol-1
zpe.correction: 0.299689 hartree
zpe.thermalcorrener: 0.320124 hartree
zpe.thermalcorrenthalpy: 0.321068 hartree
zpe.thermalcorrgfe: 0.249219 hartree
zpe.sumelectzpe: -1037.065357 hartree
zpe.sumelectthermal: -1037.044922 hartree
zpe.sumelectthermalent: -1037.043978 hartree
zpe.sumelectthermalfe: -1037.115828 hartree
dipole: -0.5121 -1.4744 -2.9091
dipole: 3.3014
quadrupole: -107.8620 -117.7846 -139.2061
quadrupole: -0.7636 1.7993 0.6748
quadrupole: 13.7556 3.8330 -17.5886 -0.7636 1.7993 0.6748
hfenergy: -1037.3650465 hartree
pointgroup: C01 [X(C19H16F1N1O2)]
dipole: 0.1391439 0.8064438 -1.0086224 debye
polarizability: 316.0407189|-33.0690858|231.6604134|4.6338946|33.6290094|146.5926235 unknown
InChI: InChI=1S/C19H16FNO2/c1-3-23-19(22)17-12(2)18(13-8-4-6-10-15(13)20)21-16-11-7-5-9-14(16)17/h4-11H,3H2,1-2H3
charge 0 multiplicity 1
39 atoms
F  -2.556705 0.955074 2.11103
O  2.472363 2.385238 -0.345054
O  3.195769 1.133244 1.482244
N  -0.794247 -1.466937 -0.516125
C  -0.07882 0.79722 0.162219
C  1.264594 0.370734 0.176711
C  1.607852 -0.998944 -0.125075
C  -1.087614 -0.198826 -0.157099
C  0.525874 -1.878942 -0.510181
C  -2.552154 0.119732 -0.17704
C  -0.47807 2.230104 0.45415
C  2.943215 -1.521512 -0.110415
C  0.805568 -3.231794 -0.885594
C  2.389933 1.306133 0.536771
C  3.188658 -2.846711 -0.477909
C  2.116713 -3.709341 -0.872275
C  -3.256359 0.675967 0.913234
C  -3.326625 -0.21865 -1.319529
C  -4.636564 0.934735 0.901433
C  -4.713725 0.031616 -1.370779
C  -5.371167 0.615258 -0.261501
C  3.584499 3.364383 -0.105725
C  4.854566 2.919303 -0.834406
H  -1.416165 2.492254 -0.062577
H  -0.6537 2.373017 1.5358
H  0.303287 2.932646 0.129715
H  3.770312 -0.881752 0.21054
H  -0.042826 -3.86217 -1.168585
H  4.213068 -3.234535 -0.458223
H  2.330243 -4.745569 -1.15583
H  -2.812032 -0.690215 -2.162453
H  -5.113256 1.359108 1.789823
H  -5.281347 -0.231542 -2.269179
H  -6.448198 0.809884 -0.293287
H  3.185204 4.308963 -0.508618
H  3.749748 3.449557 0.982411
H  5.631749 3.699756 -0.735385
H  5.250791 1.984823 -0.403015
H  4.657263 2.762888 -1.90872
