program: Gaussian 09
title: 000269141
version: EM64L-G09RevD.01
frameworkgroup: C1[X(C17H13Cl2N)]
method: RPBEPBE
basis: SDD
operation: Freq
keyword: #p
keyword: freq=noraman
keyword: PBEPBE/SDD
title: #p freq=noraman PBEPBE/SDD
converged: YES YES NO NO
title: Mulliken charges:
elementType: Cl Cl N C C C C C C C C C C C C C C C C C H H H H H H H H H H H H H
charge: -0.043398 -0.057468 0.074468 0.532109 -0.726493 0.275568 -0.634463 -0.084272 0.364804 0.520226 -0.360700 -0.319776 -0.292142 -0.809264 -0.441579 -0.367174 -0.312812 -0.202794 -0.207948 -0.118313 0.230816 0.234363 0.249482 0.251187 0.267551 0.259527 0.241070 0.238239 0.240194 0.238981 0.247969 0.256056 0.255985
chargesum: 0.00000
title: Mulliken charges with hydrogens summed into heavy atoms:
elementType: Cl Cl N C C C C C C C C C C C C C C C C C
charge: -0.043398 -0.057468 0.074468 0.532109 -0.261314 0.275568 -0.384981 -0.084272 0.364804 0.520226 -0.109513 -0.052225 -0.032615 -0.089762 -0.202598 -0.119205 -0.312812 0.053262 0.048037 -0.118313
polarizability: 3.43859182e+02 2.01500954e-01 1.72647720e+02 -2.99424474e+01 -2.10451096e+00 1.42991897e+02
1716.lowfreq: -7.9062 -4.9075 -0.0021 -0.0017 -0.0012 2.2059 14.2185 23.4478 29.0467
frequency: 14.1747 23.4097 29.0184 70.9092 106.1429 147.6202 158.2705 164.8407 185.3325 197.9914 212.0477 244.5107 279.7069 298.6682 340.7548 350.1782 356.6387 409.0338 414.8068 425.0361 475.2237 495.1072 514.5526 521.3920 529.0981 566.4245 588.9211 626.6468 639.7208 675.6246 702.0568 727.9539 770.5497 788.2048 803.0832 821.4080 831.7936 855.2659 866.3001 866.9974 897.2723 907.3611 942.6755 965.6573 970.7747 984.1018 988.4937 1000.7848 1044.6203 1065.4611 1072.7904 1093.5626 1107.4549 1148.6135 1184.1991 1187.3192 1192.4769 1215.2266 1253.9520 1271.7151 1285.2045 1294.4828 1307.3177 1339.7337 1377.2609 1391.0063 1398.5955 1401.4852 1412.2283 1456.5322 1460.6922 1468.7093 1473.8481 1478.3195 1509.7494 1556.0156 1577.7324 1587.4179 1600.9880 1628.9505 2972.3318 2980.7805 3018.8341 3058.0659 3097.3978 3127.7569 3129.3687 3134.4487 3135.4540 3168.3219 3170.5493 3171.4445 3173.0022
redmass: 5.6267 5.9821 5.6034 7.8037 8.4582 3.7501 2.0427 4.8774 2.0218 5.7578 3.2612 3.9205 5.5311 4.9738 5.0091 5.1646 3.4911 2.8998 7.1987 3.3115 3.7569 3.9276 4.7160 5.5967 3.3139 4.5213 6.0785 6.9425 5.0946 4.0372 4.3579 4.3580 3.5952 3.2203 4.0262 1.5302 1.2497 1.7975 2.1349 2.3089 1.7223 2.8882 1.5666 1.5797 1.5115 1.7833 1.3768 4.2626 1.5690 2.5103 2.7378 2.2047 1.3635 1.3652 1.1549 1.1571 2.3566 1.9995 1.9536 2.2662 1.5039 3.5220 1.6331 2.3316 6.4878 2.9396 2.4892 1.6649 3.0429 2.3161 1.3801 1.0520 1.2030 2.2500 4.0718 8.2922 6.0417 7.3501 6.2279 6.7242 1.0597 1.0379 1.1002 1.0971 1.0986 1.0900 1.0905 1.0895 1.0895 1.0951 1.0960 1.0960 1.0937
irintensity: 0.1766 0.0848 0.6412 0.0826 0.0629 2.3682 0.4034 0.4911 0.7976 0.6580 1.2854 1.1215 1.3945 3.2125 3.2725 16.8574 2.6662 0.3510 5.3278 2.7061 11.9965 15.5055 8.6596 3.7224 5.1357 5.8201 15.4624 0.5671 7.6982 1.1651 0.7591 1.2623 34.5081 4.3181 23.2122 63.3034 0.4179 25.2886 38.3236 31.0856 9.5171 11.6489 8.8088 4.9824 2.3674 10.2752 0.1622 51.0745 5.9120 3.2109 41.5447 49.9965 15.1241 19.3525 1.7993 6.1213 8.4431 2.5249 4.7948 34.9788 1.7718 39.9164 4.1719 12.2789 0.4539 3.3039 6.3119 27.5173 24.6491 20.9297 15.5476 14.7771 68.4156 75.8382 18.6078 103.4821 100.2812 3.9646 4.5389 4.5030 24.0167 17.2922 9.9659 13.6254 20.3409 11.1591 11.1640 11.1318 7.4732 6.4749 6.1006 1.1431 2.4762
temp: 298.150 k
press: 1.00000 atm
elementType: 17 17 7 6 6 6 6 6 6 6 6 6 6 6 6 6 6 6 6 6 1 1 1 1 1 1 1 1 1 1 1 1 1
symmnumber: 1
zpe: 651569.7 jmol-1
zpe.correction: 0.248170 hartree
zpe.thermalcorrener: 0.265490 hartree
zpe.thermalcorrenthalpy: 0.266434 hartree
zpe.thermalcorrgfe: 0.200074 hartree
zpe.sumelectzpe: -1629.118070 hartree
zpe.sumelectthermal: -1629.100750 hartree
zpe.sumelectthermalent: -1629.099806 hartree
zpe.sumelectthermalfe: -1629.166166 hartree
dipole: -1.0170 4.9457 -0.0905
dipole: 5.0500
quadrupole: -155.4059 -127.9682 -124.7000
quadrupole: 11.4422 -13.2384 -0.8621
quadrupole: -19.3812 8.0565 11.3247 11.4422 -13.2384 -0.8621
hfenergy: -1629.3662394 hartree
pointgroup: C01 [X(C17H13Cl2N1)]
dipole: -0.4919346 -0.7081548 -1.7899744 debye
polarizability: 337.9404094|-44.1363318|154.6538776|8.9752239|11.3862894|166.9045115 unknown
InChI: InChI=1S/C17H13Cl2N/c1-11-8-17(19)20-16-7-4-13(10-15(11)16)9-12-2-5-14(18)6-3-12/h2-8,10H,9H2,1H3
charge 0 multiplicity 1
33 atoms
Cl 6.039991 -0.133536 1.845971
Cl -6.615225 0.120076 1.911508
N  3.503301 0.607618 1.243579
C  -0.198075 0.393713 -0.83285
C  -1.526928 0.37986 -1.582502
C  2.084529 -0.489694 -0.478768
C  0.818867 -0.516889 -1.1471
C  2.302664 0.509689 0.545882
C  3.162559 -1.409932 -0.77615
C  -2.769974 0.338014 -0.693726
C  0.037649 1.372835 0.190047
C  1.258079 1.431741 0.862491
C  4.356018 -1.281375 -0.056133
C  3.01199 -2.48234 -1.834041
C  -3.877304 1.180156 -0.962477
C  -2.860031 -0.5692 0.393683
C  4.450698 -0.254873 0.932792
C  -5.052461 1.122354 -0.178305
C  -4.023688 -0.643262 1.189627
C  -5.10609 0.206306 0.888099
H  -1.588334 1.277622 -2.229687
H  -1.539517 -0.491345 -2.267411
H  0.641073 -1.266596 -1.92702
H  -0.761436 2.078832 0.443986
H  1.454535 2.173429 1.642194
H  5.204388 -1.945576 -0.23729
H  2.801009 -2.040914 -2.826207
H  3.929171 -3.087449 -1.919887
H  2.174577 -3.165041 -1.596895
H  -3.829301 1.893082 -1.794399
H  -2.010436 -1.220699 0.628229
H  -5.902913 1.776036 -0.392051
H  -4.087087 -1.344542 2.026709
