program: Gaussian 09
title: 000269140
version: EM64L-G09RevD.01
frameworkgroup: C1[X(C17H14ClNO)]
method: RPBEPBE
basis: SDD
operation: Freq
keyword: #p
keyword: freq=noraman
keyword: PBEPBE/SDD
title: #p freq=noraman PBEPBE/SDD
converged: YES YES NO NO
title: Mulliken charges:
elementType: Cl O N C C C C C C C C C C C C C C C C C H H H H H H H H H H H H H H
charge: -0.058695 -0.265580 -0.413737 0.222032 0.536765 0.285513 -0.727327 -0.640784 0.379144 -0.366423 -0.401342 0.520192 -0.457060 0.053175 -0.812738 -0.368163 -0.442415 -0.209032 -0.203682 -0.118577 0.233741 0.229395 0.250475 0.249212 0.233678 0.327830 0.251072 0.237739 0.240310 0.236639 0.248647 0.238882 0.255494 0.255619
chargesum: 0.00000
title: Mulliken charges with hydrogens summed into heavy atoms:
elementType: Cl O N C C C C C C C C C C C C C C C C C
charge: -0.058695 -0.265580 -0.085907 0.222032 0.536765 0.285513 -0.264190 -0.390309 0.379144 -0.117211 -0.167664 0.520192 -0.205988 0.053175 -0.098051 -0.119516 -0.203532 0.046462 0.051937 -0.118577
polarizability: 3.30008668e+02 3.05654610e+00 1.68995655e+02 2.84193327e+01 1.57035534e+00 1.41267739e+02
1716.lowfreq: -5.9821 -0.0011 0.0007 0.0009 3.6090 4.4365 15.8834 26.6084 35.1337
frequency: 15.7894 26.4459 35.0450 77.4940 109.8582 151.8803 167.0299 172.8454 184.9139 214.7222 228.5550 282.3562 304.6084 318.5354 337.0411 359.7931 387.5158 410.2451 419.1023 459.2849 489.7450 492.7638 517.5052 530.1739 551.6883 589.0395 622.6899 635.5696 643.5258 673.3693 704.7064 732.7493 735.8577 767.2306 786.7727 817.8230 831.9333 841.9597 845.5546 873.6133 901.0079 914.4222 931.2679 942.0116 959.2164 968.1380 972.7551 1000.6200 1004.6583 1046.7892 1068.2069 1072.5890 1107.0599 1155.6894 1183.7837 1185.0396 1188.1263 1207.9200 1234.6364 1249.4739 1272.8187 1286.2142 1290.4913 1307.6385 1356.2223 1377.2282 1395.1533 1398.3721 1403.1270 1409.7933 1449.0896 1461.4827 1467.7759 1471.0215 1478.1444 1496.5866 1562.2223 1586.6655 1594.5653 1600.9802 1627.5803 1655.4242 2970.7396 2979.1173 3016.4217 3055.1549 3099.8855 3122.9498 3127.1281 3134.9064 3135.3676 3146.7166 3167.6617 3169.6427 3170.8615 3511.6252
redmass: 5.5466 5.7720 5.0342 6.9099 7.5146 3.7332 4.8480 2.1778 3.1949 1.6942 4.4251 5.9425 3.7515 4.4803 5.3956 2.7495 8.0683 2.8881 3.3291 5.0651 3.5658 5.4008 3.3990 4.3969 4.4279 3.3085 6.1594 5.7951 2.8375 2.8377 4.4240 2.4769 2.4193 3.6026 3.0821 1.4952 1.2542 1.7371 4.0725 1.4560 1.5805 3.4128 3.1500 1.6010 1.3983 1.4422 1.5988 4.2830 1.9425 1.5693 2.2789 2.7281 1.3623 1.3817 1.2093 1.5331 1.3708 2.4781 2.1171 1.6587 2.5089 1.4814 2.0770 1.5563 2.1075 6.3919 1.5282 2.2329 2.0548 6.2658 3.3418 1.2380 1.0510 1.1139 2.2685 3.0729 6.1220 7.2100 5.3344 6.2416 6.6649 6.0295 1.0598 1.0380 1.1003 1.0970 1.0983 1.0874 1.0900 1.0906 1.0895 1.0970 1.0951 1.0926 1.0960 1.0767
irintensity: 0.5892 0.3316 0.8454 1.4688 0.5509 1.1085 1.7878 0.1367 3.8589 0.5393 0.7692 1.2544 0.6073 1.6614 1.0558 6.7710 14.0179 0.1112 2.9259 1.1547 20.6455 5.6102 9.5285 6.0252 7.7177 1.0193 2.9736 13.1585 16.8211 15.6289 0.5962 28.4202 18.9677 0.8142 27.9620 88.9451 0.5948 25.6407 4.4341 19.6177 14.0531 1.9365 15.4582 7.0937 2.2975 1.4690 2.6251 50.0377 2.2549 5.7450 7.2768 37.4647 13.5885 9.4998 0.7829 1.1153 4.5386 3.8139 5.0072 11.9337 23.7473 2.9316 16.1047 0.2233 51.4280 2.3261 17.8809 11.6769 35.6182 22.7778 16.1218 26.2137 14.4386 6.5242 95.4064 23.1060 14.3765 10.5602 108.7814 4.0245 33.6247 524.9126 26.8988 17.1327 10.5467 15.2821 22.2681 8.7857 11.3295 11.9932 8.8751 10.5202 6.8234 3.4870 1.1482 32.2615
temp: 298.150 k
press: 1.00000 atm
elementType: 17 8 7 6 6 6 6 6 6 6 6 6 6 6 6 6 6 6 6 6 1 1 1 1 1 1 1 1 1 1 1 1 1 1
symmnumber: 1
zpe: 690230.4 jmol-1
zpe.correction: 0.262895 hartree
zpe.thermalcorrener: 0.279901 hartree
zpe.thermalcorrenthalpy: 0.280845 hartree
zpe.thermalcorrgfe: 0.215926 hartree
zpe.sumelectzpe: -1244.894805 hartree
zpe.sumelectthermal: -1244.877799 hartree
zpe.sumelectthermalent: -1244.876855 hartree
zpe.sumelectthermalfe: -1244.941774 hartree
dipole: 2.3203 3.1626 1.4971
dipole: 4.1985
quadrupole: -170.8166 -117.4627 -118.1623
quadrupole: -13.2924 5.2663 -4.3479
quadrupole: -35.3361 18.0178 17.3183 -13.2924 5.2663 -4.3479
hfenergy: -1245.1577 hartree
pointgroup: C01 [X(C17H14Cl1N1O1)]
dipole: -0.9987048 0.0813385 1.3131905 debye
polarizability: 325.5992047|-39.7499642|150.9213868|-5.0457647|-11.0243027|163.7514709 unknown
InChI: InChI=1S/C17H14ClNO/c1-11-8-17(20)19-16-7-4-13(10-15(11)16)9-12-2-5-14(18)6-3-12/h2-8,10,19H,9H2,1H3
charge 0 multiplicity 1
34 atoms
Cl -6.619461 0.114636 -1.881982
O  5.722951 -0.068016 -1.606377
N  3.537035 0.635942 -1.190839
C  2.115479 -0.432051 0.478957
C  -0.189036 0.409579 0.836246
C  2.309262 0.567608 -0.530663
C  -1.514871 0.360605 1.591185
C  0.855181 -0.48264 1.141173
C  3.219422 -1.346433 0.778697
C  0.032828 1.389125 -0.176191
C  1.25956 1.47122 -0.849661
C  -2.762433 0.322301 0.708858
C  4.410632 -1.223044 0.087984
C  4.6446 -0.214194 -0.949287
C  3.049994 -2.415186 1.839149
C  -2.850149 -0.566229 -0.394298
C  -3.876849 1.148353 0.997853
C  -4.017216 -0.637685 -1.185346
C  -5.055351 1.093906 0.218235
C  -5.106013 0.196592 -0.864036
H  -1.511419 -0.528934 2.252469
H  -1.588145 1.238416 2.26393
H  0.695374 -1.241156 1.916102
H  -0.773163 2.085428 -0.435104
H  1.414805 2.231427 -1.624585
H  3.683974 1.346897 -1.914363
H  5.255506 -1.888454 0.287346
H  2.825568 -1.969304 2.826675
H  3.965419 -3.020277 1.938898
H  2.214536 -3.097193 1.592121
H  -1.995443 -1.205259 -0.644131
H  -3.831635 1.84609 1.842789
H  -4.078962 -1.325967 -2.033375
H  -5.910783 1.735695 0.447874
