program: Gaussian 09
title: 000269109
version: EM64L-G09RevD.01
frameworkgroup: C1[X(C8H6Cl2N2O)]
method: RPBEPBE
basis: SDD
operation: Freq
keyword: #p
keyword: freq=noraman
keyword: PBEPBE/SDD
title: #p freq=noraman PBEPBE/SDD
converged: NO NO NO NO
title: Mulliken charges:
elementType: Cl Cl O N N C C C C C C C C H H H H H H
charge: 0.012766 -0.053104 -0.417994 -0.209288 0.015590 0.342176 0.321161 -0.303472 -0.396722 -0.326552 -0.339801 -0.179352 -0.101434 0.260487 0.281336 0.231060 0.246522 0.259243 0.357381
chargesum: 0.00000
title: Mulliken charges with hydrogens summed into heavy atoms:
elementType: Cl Cl O N N C C C C C C C C
charge: 0.012766 -0.053104 -0.060613 -0.209288 0.015590 0.342176 0.321161 -0.042986 -0.396722 -0.045216 0.137780 0.079891 -0.101434
polarizability: 1.69951851e+02 2.34828113e+00 1.40349104e+02 -3.00867050e+00 5.04461772e+00 5.50534232e+01
1716.lowfreq: -2.9650 0.0023 0.0028 0.0029 3.3591 6.4290 52.2253 67.1794 118.2371
frequency: 52.1972 67.1735 118.2368 130.7284 146.6330 218.9135 265.9484 278.7715 313.3370 353.6679 398.7913 409.5743 423.0847 463.3993 544.8581 571.4432 587.9608 622.0622 655.2337 736.0156 754.4802 797.0759 804.2476 882.3753 920.7099 945.2287 961.4286 977.5121 1052.1131 1070.7115 1124.1703 1160.8831 1245.6600 1268.1291 1275.7261 1324.1157 1346.2634 1370.5752 1401.0116 1409.5339 1451.7489 1452.6807 1473.2936 1577.1666 1621.9460 3030.6462 3111.4815 3162.3315 3177.8867 3181.9589 3561.8275
redmass: 5.0427 7.0924 9.0266 13.2813 6.3407 2.7982 6.7726 7.7179 5.4836 8.0615 5.1737 1.5160 3.0315 5.5836 4.9065 4.7590 7.0003 7.0649 7.1286 4.9460 5.7589 7.5750 1.4878 1.4141 2.5302 1.3357 7.2518 4.1868 2.0801 2.3463 2.1210 1.6673 1.3952 1.6744 5.8325 1.8472 2.7494 2.2988 1.8323 2.3032 1.8145 1.8892 4.1107 8.4378 8.1749 1.0599 1.1060 1.0886 1.0940 1.0978 1.0663
irintensity: 3.8266 0.2587 0.6722 0.7031 0.0385 5.1931 2.7937 1.1170 8.0115 24.7836 34.2761 123.9396 6.6971 39.7581 9.5313 8.1907 24.6634 3.4549 35.3781 0.0379 7.9367 122.4227 48.8246 19.7411 123.3896 0.3383 95.5962 11.3984 11.6963 10.0751 23.4451 50.6412 32.5014 75.7371 99.5936 7.0527 11.1854 37.0002 47.9156 3.2350 7.0781 19.9055 127.1013 6.8260 1.4484 37.2869 7.1768 0.5248 0.1623 3.4788 16.3748
temp: 298.150 k
press: 1.00000 atm
elementType: 17 17 8 7 7 6 6 6 6 6 6 6 6 1 1 1 1 1 1
symmnumber: 1
zpe: 336467.4 jmol-1
zpe.correction: 0.128154 hartree
zpe.thermalcorrener: 0.139604 hartree
zpe.thermalcorrenthalpy: 0.140548 hartree
zpe.thermalcorrgfe: 0.089315 hartree
zpe.sumelectzpe: -1412.343166 hartree
zpe.sumelectthermal: -1412.331716 hartree
zpe.sumelectthermalent: -1412.330771 hartree
zpe.sumelectthermalfe: -1412.382005 hartree
dipole: 1.1602 -1.8757 -0.4643
dipole: 2.2539
quadrupole: -90.5706 -89.0658 -88.3282
quadrupole: -2.3265 0.3652 4.0048
quadrupole: -1.2491 0.2557 0.9934 -2.3265 0.3652 4.0048
hfenergy: -1412.4713198 hartree
pointgroup: C01[X(C8H6Cl2N2O1)]
dipole: 0.4770996 0.7093991 0.2354805 debye
dipolederiv: -0.0969396 0.0162087 -0.0047121 0.0602809 -0.7070392 -0.0713793 -0.0033349 -0.0903171 -0.0330248 -0.8529167 0.0285249 -0.0712171 -0.0545517 -0.1130937 -0.0110878 -0.0901436 -0.0021454 -0.0768098 -0.7697526 -0.3215791 -0.0293438 -0.4876379 -0.4528869 0.1458555 0.2554915 0.3564714 -0.6441742 -0.8348656 -0.1618246 0.0335711 -0.5237322 -0.7485747 0.0235736 -0.2205561 -0.1129015 -0.2221788 -0.5892446 -0.0073559 -0.0429425 0.3275829 0.1628692 0.0503789 0.035761 0.0573761 -0.1495754 0.6289138 0.0465583 0.0314585 -0.0010833 -0.2359433 -0.0319912 0.0697929 -0.0324378 0.0513448 -0.0048349 0.0708043 -0.0023557 -0.1280612 -0.3954188 -0.0496881 -0.0225539 -0.0528956 0.0520301 -0.0768101 -0.0728859 -0.0045122 0.0194871 0.1175192 0.0150024 -0.005593 0.0068778 -0.1398567 0.1347501 -0.278225 0.0150319 -0.2895126 1.3188592 0.1461377 -0.015321 0.1515439 -0.0313395 -0.1954027 -0.1470095 -0.0246673 0.0382235 0.0481422 0.0217925 -0.0062242 0.0019001 -0.0943632 1.0760742 0.5789861 -0.0950014 0.7905222 0.7825067 -0.1484452 -0.1872345 -0.2330954 0.7167312 -0.2516591 0.0647681 -0.0071211 -0.0033139 0.1111121 0.0230282 -0.0134811 0.0293523 -0.1049484 1.2423377 0.0429302 0.1368676 0.1074783 -0.0667689 0.0158437 0.1516968 0.0063543 -0.0592409 0.0481056 -0.069846 -0.0212955 -0.0393369 -0.0086314 -0.0228531 -0.0099287 -0.0224391 0.1671834 0.0843623 -0.0192465 -0.0113209 -0.0488414 0.0376097 -0.0226902 -0.0140831 -0.0201499 0.1693716 0.0491064 0.0275255 0.0932929 -0.0629892 -0.036438 -0.0869751 0.0644718 -0.0171607 -0.0079986 -0.0510023 0.0034605 -0.0562458 0.0760127 0.0179369 0.1161424 -0.0056679 0.0661554 0.010971 0.0456288 0.0765609 -0.0018476 0.0590501 0.0207577 -0.0111911 -0.0070721 -0.0085364 0.1606282 0.4141495 0.1216447 0.0623612 0.1604225 0.1474819 -0.1014537 0.0239803 -0.0839523 0.2352501 unknown
polarizability: 169.3301608|-4.011269|139.9035654|7.2897814|8.9081555|56.1206519 unknown
InChI: InChI=1S/C8H6Cl2N2O/c9-5-1-2-7-6(3-5)8(10)11-12(7)4-13/h1-3,13H,4H2
charge 0 multiplicity 1
19 atoms
Cl 0.803206 -3.368406 -0.244294
Cl -4.274578 0.172966 -0.304445
O  3.025899 2.129124 -0.657779
N  1.652697 0.394497 0.371833
N  2.011291 -0.957301 0.204631
C  0.275913 0.584509 0.23279
C  -0.292808 -0.713458 -0.001711
C  -0.523019 1.750849 0.28883
C  0.842682 -1.595872 -0.001282
C  -1.692356 -0.870636 -0.16947
C  2.707134 1.386011 0.552541
C  -1.909341 1.588899 0.122797
C  -2.464025 0.294398 -0.098003
H  -0.091197 2.744623 0.43378
H  -2.14136 -1.851193 -0.346228
H  2.369241 2.15364 1.265614
H  3.577294 0.837622 0.955898
H  -2.573218 2.457344 0.15456
H  3.456743 1.527685 -1.317562
