program: Gaussian 09
title: 000269137
version: EM64L-G09RevD.01
frameworkgroup: C1[X(C18H16ClNO)]
method: RPBEPBE
basis: SDD
operation: Freq
keyword: #p
keyword: freq=noraman
keyword: PBEPBE/SDD
title: #p freq=noraman PBEPBE/SDD
converged: YES YES NO NO
title: Mulliken charges:
elementType: Cl O N C C C C C C C C C C C C C C C C C C H H H H H H H H H H H H H H H H
charge: -0.049586 -0.266019 0.057300 0.556356 -0.724306 0.256130 -0.038156 -0.584377 0.517724 -0.391793 0.388101 -0.390736 -0.435826 -0.383711 -0.302689 -0.810929 -0.314084 -0.350730 -0.350810 0.311231 -0.538380 0.233886 0.226679 0.273248 0.245786 0.241069 0.233702 0.237862 0.259083 0.239804 0.236621 0.240291 0.249843 0.240300 0.245415 0.220148 0.221554
chargesum: 0.00000
title: Mulliken charges with hydrogens summed into heavy atoms:
elementType: Cl O N C C C C C C C C C C C C C C C C C C
charge: -0.049586 -0.266019 0.057300 0.556356 -0.263741 0.256130 -0.038156 -0.311129 0.517724 -0.146007 0.388101 -0.149667 -0.202124 -0.145849 -0.043605 -0.094213 -0.314084 -0.100888 -0.110511 0.311231 0.148737
polarizability: 3.45729323e+02 -1.80027601e+01 1.79493934e+02 2.78236148e+01 1.68716743e-01 1.60360328e+02
1716.lowfreq: -3.9923 -2.4224 -0.0015 -0.0006 0.0014 3.2445 12.8437 23.1352 30.3059
frequency: 12.8133 23.0603 30.3029 80.2503 93.6962 100.8845 134.0804 142.5660 161.2131 185.3735 208.4396 226.8101 244.4857 261.5369 278.9220 291.3944 317.9584 343.6961 349.6932 414.1006 423.9354 439.1996 489.4830 498.3644 506.2571 515.5931 538.5577 562.8942 590.5963 598.3172 631.6707 661.2943 700.2024 720.2372 732.7822 755.0816 786.2543 810.3977 817.1141 827.5692 846.6696 864.2628 869.9126 905.1495 929.1948 944.2554 961.7300 965.9823 979.2612 985.2043 988.5108 1003.7238 1043.3424 1064.1283 1090.4560 1110.6861 1111.8520 1155.1594 1167.2062 1175.3946 1179.1999 1183.8421 1210.8196 1231.1082 1243.4956 1272.1451 1289.3703 1300.4317 1314.8142 1346.1968 1381.5359 1387.6985 1401.0528 1417.6761 1431.3100 1435.4406 1440.9600 1462.8433 1465.4568 1467.4655 1471.7951 1473.1873 1502.6252 1512.4765 1553.9333 1579.4449 1584.7341 1623.4873 1629.0298 2958.8451 2974.2812 2980.9725 3021.8414 3046.2320 3058.3766 3097.2085 3121.6897 3124.1191 3126.3866 3129.1315 3149.9519 3154.1670 3159.7539 3166.7082 3173.6247
redmass: 6.6624 3.9125 4.3502 3.6925 7.0096 3.7651 5.8848 1.1656 5.1560 2.8744 3.3375 1.3266 3.0713 4.0678 4.0769 5.6820 5.5098 2.5963 5.6427 2.9377 4.7292 3.2067 4.3061 4.1783 4.4831 4.0300 3.4398 3.7662 7.2408 5.4476 6.6914 4.0606 3.3471 4.5171 5.3457 3.5520 3.4125 3.1168 1.5199 1.3997 1.8898 7.1880 1.3626 1.6047 2.0175 1.6646 1.5010 1.7785 1.4072 1.8763 8.2476 2.6748 1.5684 3.3649 2.0419 1.3552 1.2615 1.3541 1.3927 1.6347 1.4144 1.1557 2.0639 3.8918 1.8757 2.1730 2.6624 1.8012 1.4652 3.0670 4.7671 2.7415 1.3628 3.1714 3.8134 1.1810 5.2196 1.1153 1.0506 1.0454 1.1541 1.0753 2.4364 3.5306 9.1604 6.2322 7.0410 6.3925 6.7147 1.0330 1.0599 1.0379 1.1003 1.1039 1.0972 1.0985 1.0896 1.0975 1.0907 1.0868 1.0930 1.0960 1.0940 1.0951 1.0935
irintensity: 0.8800 1.2322 0.5750 4.5613 0.9423 1.4685 1.6178 0.4384 0.9617 0.8715 2.7321 0.0594 1.6832 0.0327 1.5385 0.0809 6.3729 4.2170 14.6511 0.4431 2.2570 6.0377 2.4567 2.0434 14.1622 17.1161 9.5264 0.0767 12.2935 14.6703 0.8110 3.6486 4.4452 1.8653 17.5166 12.3717 2.4010 14.6224 27.0610 31.5550 22.2655 68.3597 30.5163 10.5220 10.4330 0.3937 0.9950 2.1092 0.1522 5.9956 40.4469 12.1669 6.4351 15.4143 63.1378 14.3995 0.3680 0.3848 20.3691 39.6356 21.1895 26.6914 16.8041 179.9597 6.5492 20.0965 48.8481 6.9065 1.2841 14.0045 10.1970 0.9333 17.8026 0.1802 54.6999 11.1355 2.1721 15.1648 14.0910 16.4627 61.3444 58.1267 149.5630 30.4482 88.3410 97.0173 9.4799 35.8964 62.1569 65.8920 26.8267 17.7571 10.2529 49.1696 13.6408 20.9434 13.7011 41.3367 2.8240 3.6828 9.9874 11.3129 13.2123 7.3808 2.8323
temp: 298.150 k
press: 1.00000 atm
elementType: 17 8 7 6 6 6 6 6 6 6 6 6 6 6 6 6 6 6 6 6 6 1 1 1 1 1 1 1 1 1 1 1 1 1 1 1 1
symmnumber: 1
zpe: 759066.6 jmol-1
zpe.correction: 0.289113 hartree
zpe.thermalcorrener: 0.307897 hartree
zpe.thermalcorrenthalpy: 0.308842 hartree
zpe.thermalcorrgfe: 0.239595 hartree
zpe.sumelectzpe: -1284.079962 hartree
zpe.sumelectthermal: -1284.061178 hartree
zpe.sumelectthermalent: -1284.060234 hartree
zpe.sumelectthermalfe: -1284.129480 hartree
dipole: -2.6828 3.9076 0.5287
dipole: 4.7693
quadrupole: -138.6504 -125.7118 -120.2122
quadrupole: 16.1217 -11.1706 2.5174
quadrupole: -10.4589 2.4797 7.9792 16.1217 -11.1706 2.5174
hfenergy: -1284.3690754 hartree
pointgroup: C01 [X(C18H16Cl1N1O1)]
dipole: -0.9033916 0.5178247 1.5609584 debye
polarizability: 339.8011613|-41.8057612|167.7708203|-17.6685718|10.9322059|178.011603 unknown
InChI: InChI=1S/C18H16ClNO/c1-12-9-18(19)20-17-11-14(5-8-16(12)17)10-13-3-6-15(21-2)7-4-13/h3-9,11H,10H2,1-2H3
charge 0 multiplicity 1
37 atoms
Cl 6.026453 -1.949446 -1.589245
O  -5.915611 -0.289947 1.060575
N  3.541804 -0.868175 -1.509108
C  0.216866 0.738619 -1.131606
C  -1.093208 0.880148 -1.902426
C  2.6858 0.559329 0.334322
C  2.520997 -0.110539 -0.938529
C  1.285662 -0.004667 -1.646806
C  -2.346865 0.552721 -1.091903
C  0.380833 1.395068 0.134837
C  3.953172 0.432205 1.020786
C  1.579287 1.311797 0.845032
C  -3.432682 1.464707 -1.02548
C  -2.47174 -0.67946 -0.405834
C  4.955778 -0.335652 0.416276
C  4.195798 1.106625 2.354483
C  4.675327 -0.950842 -0.841831
C  -4.603389 1.159719 -0.305255
C  -3.637247 -1.005987 0.322462
C  -4.709751 -0.080028 0.371937
C  -6.076637 -1.562292 1.767555
H  -1.045178 0.233261 -2.800349
H  -1.178341 1.91945 -2.278641
H  1.209426 -0.526719 -2.606365
H  -0.461271 1.963937 0.545621
H  1.674715 1.827981 1.806238
H  -3.363055 2.42703 -1.547723
H  -1.643361 -1.397682 -0.435644
H  5.933327 -0.469197 0.885707
H  3.473903 0.759555 3.117305
H  5.211397 0.89519 2.726874
H  4.083534 2.204262 2.275855
H  -5.442739 1.859858 -0.253698
H  -3.697843 -1.969265 0.838132
H  -7.076367 -1.512968 2.223453
H  -5.311586 -1.684115 2.559243
H  -6.027112 -2.420782 1.069555
