program: Gaussian 09
title: 000269301
version: EM64L-G09RevD.01
frameworkgroup: C1[X(C24H25NO6S)]
method: RPBEPBE
basis: SDD
operation: Freq
keyword: #p
keyword: freq=noraman
keyword: PBEPBE/SDD
title: #p freq=noraman PBEPBE/SDD
converged: YES YES NO NO
title: Mulliken charges:
elementType: S O O O O O O N C C C C C C C C C C C C C C C C C C C C C C C C H H H H H H H H H H H H H H H H H H H H H H H H H
charge: 0.950559 -0.516414 -0.518197 -0.292921 -0.287988 -0.273212 -0.248037 -0.398444 -0.564108 0.284255 0.532412 -0.067994 0.208133 -0.302733 -0.477126 -0.228875 -0.241164 -0.487100 -0.344906 0.239578 0.447571 -0.364119 -0.379766 -0.234484 -0.329205 0.172218 -0.238338 0.182296 -0.798472 -0.546978 -0.521574 -0.505439 0.202464 0.273949 0.234371 0.319574 0.289584 0.284739 0.228552 0.268454 0.245109 0.245245 0.232731 0.248180 0.235920 0.229981 0.245532 0.230627 0.229408 0.262350 0.226761 0.208402 0.261465 0.225309 0.229237 0.258707 0.233921
chargesum: 0.00000
title: Mulliken charges with hydrogens summed into heavy atoms:
elementType: S O O O O O O N C C C C C C C C C C C C C C C C C C C C C C C C
charge: 0.950559 -0.516414 -0.518197 -0.292921 -0.287988 -0.273212 -0.248037 -0.398444 -0.087696 0.284255 0.532412 -0.067994 0.208133 -0.068362 -0.157552 0.060708 0.043575 -0.258548 -0.076452 0.239578 0.447571 -0.119010 -0.134521 -0.001753 -0.081025 0.172218 -0.002418 0.182296 -0.092332 0.171542 0.173602 0.216426
polarizability: 3.95699642e+02 -2.47947767e+01 3.28246521e+02 1.27599144e+01 -1.26976353e+00 2.76946948e+02
1716.lowfreq: -10.3557 -6.7890 -2.7008 -0.0015 -0.0009 -0.0004 7.9946 17.4446 22.5616
frequency: 5.4992 17.4045 22.5514 28.9069 39.7314 42.9015 44.0881 56.1045 60.1536 67.6748 85.1095 98.4109 101.4013 102.7015 106.7622 120.7166 123.9206 132.9551 155.6857 158.6838 173.2393 184.7978 199.8461 206.6800 215.3140 224.1495 243.2213 248.0360 273.4615 281.1624 298.0534 305.6411 319.7151 328.3875 344.9431 366.2403 375.6017 384.3712 392.0534 403.1229 407.3823 428.6864 453.6492 472.8055 491.8905 503.1629 535.6854 545.6433 550.3377 554.3045 578.5633 592.5994 620.4095 622.2985 640.9240 676.5537 706.9257 708.2546 731.4424 735.7664 750.0072 767.6136 774.4967 774.8585 788.9974 809.0787 817.0093 826.4712 850.3351 879.8707 897.7482 916.4355 919.1641 934.5270 948.1722 959.8018 962.2700 963.4392 981.5689 990.2177 992.2496 993.4260 994.1779 1009.6900 1012.1487 1044.0376 1045.4105 1049.2809 1057.0123 1107.5150 1110.1498 1112.4183 1113.6103 1117.4746 1131.4024 1146.8125 1150.7624 1156.1591 1163.1705 1176.9538 1182.8619 1206.0362 1217.3176 1226.9673 1232.8996 1255.5691 1261.4924 1271.3618 1285.9686 1294.7796 1346.0289 1373.0031 1379.3209 1386.8047 1389.6970 1399.1416 1407.3179 1419.3556 1426.8076 1427.6616 1447.3731 1451.6004 1455.1786 1464.1086 1466.9039 1469.5296 1470.6744 1471.2394 1474.7047 1475.8434 1482.5385 1486.0750 1501.0361 1572.0180 1584.7992 1590.3042 1591.1579 1592.5616 1609.3215 1621.6591 2928.5589 2971.5065 2977.9676 2981.6837 3003.1924 3010.5817 3064.3587 3075.4270 3081.0442 3093.2314 3107.1242 3123.9516 3124.4601 3127.8900 3134.3533 3134.7941 3136.3825 3147.2800 3151.3982 3153.7950 3159.4401 3163.3772 3164.0741 3164.4967 3176.6324
redmass: 5.5007 5.3771 4.6738 4.8261 4.7998 1.0342 3.6562 4.2278 3.1240 4.4801 4.1471 3.3511 2.9772 3.4686 4.5049 2.1753 2.0658 4.9426 2.6744 3.8922 1.8789 4.3399 3.8470 5.9154 4.7349 8.4002 2.2526 5.6987 2.0609 4.9307 4.7947 4.4800 4.3926 5.0648 3.7863 4.7313 4.1438 4.0420 6.2308 5.6015 2.8982 9.6242 4.6406 3.6674 4.5466 3.2026 6.4452 4.0656 5.4751 4.3865 5.9022 4.8304 6.9103 4.4482 5.9455 5.0549 3.5716 5.1144 4.1459 4.0295 5.3437 2.8531 2.2698 2.7788 4.8063 11.7400 1.4872 1.3707 1.2418 1.4976 1.4521 4.4272 6.6066 1.3635 11.7122 8.2464 1.4058 1.3021 1.3972 1.6438 3.7311 1.3873 3.9767 4.7136 2.2739 3.3404 2.4480 1.5951 3.0726 1.4861 1.5925 1.2656 1.2828 1.2879 1.7240 1.6606 1.4711 1.4233 1.5456 1.0650 1.1457 1.8700 3.0059 2.2735 3.0832 2.6736 1.6738 1.5203 1.8793 1.2689 1.5346 10.1773 6.1137 5.3135 3.0016 1.2202 2.0533 1.2679 1.9148 1.2439 1.2791 1.0502 1.0781 1.0520 1.0497 2.3545 1.1171 2.1776 1.0604 1.1277 1.0552 1.1581 2.4367 6.7676 7.7096 6.2376 6.7494 5.9906 6.0524 9.5367 1.0651 1.0352 1.0324 1.0388 1.0294 1.0928 1.0949 1.1024 1.0962 1.1001 1.1044 1.0892 1.1048 1.1027 1.0859 1.0890 1.0894 1.1048 1.0902 1.0918 1.0957 1.0949 1.0966 1.0949 1.0986
irintensity: 0.8318 1.7818 1.7595 0.0585 1.4662 0.6186 0.0906 0.5989 2.6255 2.2574 3.1134 1.8476 1.7506 8.4245 1.4026 0.6555 2.4625 0.5051 1.6829 2.7739 2.4254 1.2081 2.2153 2.1343 1.2742 8.3845 0.0367 7.0873 4.3211 9.2414 9.1290 7.9383 5.1814 2.5691 14.7280 8.7479 2.2296 7.8125 10.1609 8.0193 0.1689 94.4622 9.5703 2.7562 10.0842 92.1877 3.6469 10.5521 12.2930 4.4789 21.1223 9.3474 0.0992 9.2392 3.7063 40.3896 3.7190 3.6823 3.3498 35.6492 5.9121 7.5797 20.2341 18.8068 9.2682 83.2442 48.4252 17.8984 0.7220 3.5689 29.6231 18.4410 1.4941 3.0545 62.6887 49.7854 1.1960 0.1855 1.0802 5.3013 4.7636 3.1191 31.8247 19.3891 4.2063 67.5459 26.0832 23.3043 165.5666 38.3110 50.5032 5.2487 1.2776 6.8387 14.7246 22.5695 39.1149 13.1443 12.3855 0.4796 13.4767 49.5445 9.3197 30.7727 180.6060 107.6368 65.1265 15.1260 54.2261 2.6188 14.3506 4.0927 0.3489 3.5025 9.6971 16.2596 30.7380 27.6222 10.1868 4.9632 11.1677 12.8844 19.5806 9.9686 20.0107 30.0834 26.9117 28.5914 13.5491 103.4305 29.2080 24.7240 114.9337 8.9193 18.7595 20.2012 2.5027 10.8249 16.9567 170.8042 37.9388 110.2363 42.4408 25.7971 43.6900 10.8733 15.9681 22.7384 41.4024 14.0500 20.3219 13.3968 18.8065 27.9652 2.0683 11.8298 8.4307 18.9771 12.8452 10.8195 3.7960 13.0829 7.2802 13.0334 13.9528
temp: 298.150 k
press: 1.00000 atm
elementType: 16 8 8 8 8 8 8 7 6 6 6 6 6 6 6 6 6 6 6 6 6 6 6 6 6 6 6 6 6 6 6 6 1 1 1 1 1 1 1 1 1 1 1 1 1 1 1 1 1 1 1 1 1 1 1 1 1
symmnumber: 1
zpe: 1149124.7 jmol-1
zpe.correction: 0.437678 hartree
zpe.thermalcorrener: 0.470687 hartree
zpe.thermalcorrenthalpy: 0.471631 hartree
zpe.thermalcorrgfe: 0.368596 hartree
zpe.sumelectzpe: -1831.170995 hartree
zpe.sumelectthermal: -1831.137986 hartree
zpe.sumelectthermalent: -1831.137042 hartree
zpe.sumelectthermalfe: -1831.240078 hartree
dipole: 5.1975 -1.2100 3.1611
dipole: 6.2025
quadrupole: -170.5320 -170.9514 -197.6787
quadrupole: -20.7881 20.7845 2.9348
quadrupole: 9.1887 8.7693 -17.9580 -20.7881 20.7845 2.9348
hfenergy: -1831.6086733 hartree
pointgroup: C01 [X(C24H25N1O6S1)]
dipole: -2.1565016 0.6359432 -0.9486123 debye
polarizability: 402.7818464|5.5949965|303.6435766|13.1548609|22.6875428|294.4676884 unknown
InChI: InChI=1S/C24H25NO6S/c1-17-9-12-19(13-10-17)32(27,28)25(21-8-6-5-7-20(21)24(26)31-4)16-18-11-14-22(29-2)23(15-18)30-3/h5-15H,16H2,1-4H3
charge 0 multiplicity 1
57 atoms
S  -1.473274 -0.881403 1.626273
O  -1.491449 0.441167 2.570342
O  -1.11417 -2.363124 2.193246
O  4.996003 -0.735794 -0.10308
O  5.446381 -1.770487 -2.732369
O  0.250047 2.92897 2.52474
O  1.624649 1.118437 2.037025
N  -0.13486 -0.519515 0.243762
C  0.097341 -1.742407 -0.564029
C  -0.311493 0.753253 -0.369579
C  1.513436 -1.718878 -1.132641
C  -3.152585 -0.984392 0.767403
C  0.001766 1.939016 0.37313
C  -0.808883 0.883839 -1.696771
C  2.579455 -1.241136 -0.332859
C  -3.876702 0.203075 0.567466
C  -3.608944 -2.248523 0.358804
C  1.774719 -2.198442 -2.434429
C  -0.256419 3.206685 -0.205026
C  3.903964 -1.249364 -0.820298
C  -5.632656 -1.146121 -0.524773
C  -5.124525 0.106386 -0.086434
C  -4.860466 -2.315765 -0.292389
C  -1.005634 2.15182 -2.276019
C  3.103179 -2.233116 -2.914727
C  4.177669 -1.772161 -2.12558
C  -0.749845 3.320579 -1.521654
C  0.696036 1.8929 1.702469
C  -6.990938 -1.236516 -1.195443
C  4.720585 -0.177148 1.230649
C  6.582762 -2.321191 -1.965787
C  0.822656 2.938783 3.890054
H  -0.640413 -1.892565 -1.382646
H  -0.010253 -2.590174 0.140571
H  -1.038216 -0.014261 -2.277985
H  2.341275 -0.817485 0.647909
H  -3.488556 1.160846 0.928414
H  -3.01821 -3.146348 0.568614
H  0.956171 -2.557299 -3.06951
H  -0.039946 4.101822 0.384808
H  -5.711952 1.016354 -0.254389
H  -5.244137 -3.289746 -0.617138
H  -1.372207 2.22826 -3.305527
H  3.338368 -2.609237 -3.915354
H  -0.919642 4.310033 -1.958757
H  -7.056303 -2.110526 -1.866017
H  -7.794263 -1.340003 -0.440545
H  -7.213082 -0.331339 -1.786903
H  5.691378 0.202665 1.582311
H  3.979875 0.640339 1.181388
H  4.346539 -0.95873 1.918953
H  6.388349 -3.377349 -1.694114
H  6.771553 -1.728443 -1.056596
H  7.439534 -2.265279 -2.654967
H  0.355963 3.802774 4.383619
H  0.560463 1.998236 4.402172
H  1.920305 3.044429 3.851608
