program: Gaussian 09
title: 000269082
version: EM64L-G09RevD.01
frameworkgroup: C1[X(C13H10N2O)]
method: RPBEPBE
basis: SDD
operation: Freq
keyword: #p
keyword: freq=noraman
keyword: PBEPBE/SDD
title: #p freq=noraman PBEPBE/SDD
converged: YES YES NO NO
title: Mulliken charges:
elementType: O N N C C C C C C C C C C C C C H H H H H H H H H H
charge: -0.265648 -0.439806 -0.702620 0.318058 0.294616 0.095621 0.109836 0.292627 -0.021153 -0.412225 -0.367052 -0.350833 -0.399953 -0.249147 -0.238321 -0.240677 0.332616 0.220920 0.224292 0.277210 0.222722 0.225113 0.229178 0.234208 0.301579 0.308837
chargesum: 0.00000
title: Mulliken charges with hydrogens summed into heavy atoms:
elementType: O N N C C C C C C C C C C C C C
charge: -0.265648 -0.107190 -0.092205 0.318058 0.294616 0.095621 0.109836 0.292627 -0.021153 -0.191305 -0.142760 -0.073623 -0.177231 -0.024034 -0.009143 -0.006469
polarizability: 2.46297602e+02 4.02939778e+00 1.85132999e+02 1.32282368e+00 1.11142270e+00 6.21418189e+01
1716.lowfreq: -7.4227 -0.0004 0.0004 0.0005 4.0137 6.3655 66.8362 95.5807 143.5144
frequency: 66.8353 95.5795 143.5136 189.0083 202.2746 243.0450 270.4286 306.3571 325.1564 347.8930 417.5699 423.1510 453.2985 473.0873 495.7652 530.2667 548.4319 557.6417 592.2552 612.4779 629.7817 657.7684 692.7882 726.2391 749.7070 764.9055 776.7462 793.1321 808.9100 872.0017 875.3063 892.7894 899.7166 953.9621 977.8730 1005.8230 1029.0414 1040.0256 1071.0115 1101.3065 1116.9086 1149.2815 1175.9790 1195.0580 1253.3743 1271.8431 1282.6653 1311.2785 1333.3733 1383.8497 1392.6244 1425.7001 1431.5361 1456.3985 1488.9132 1499.6140 1564.3685 1601.3557 1612.3834 1619.1884 1628.5039 1652.7607 3126.8099 3131.2417 3145.2894 3148.9659 3158.7542 3169.2422 3172.4875 3503.1336 3513.1243 3645.8460
redmass: 5.1983 4.1331 5.9805 4.0099 3.4610 3.7567 3.2673 1.7209 4.6344 4.0468 6.9395 3.2516 4.3677 3.8018 5.5262 1.3608 3.2438 5.8669 4.2015 5.0608 5.5220 2.6587 5.5046 1.7049 2.3309 1.8543 2.4980 2.0161 3.0443 2.0514 2.3910 1.5420 5.8062 1.3323 1.3774 1.3401 2.4289 1.9042 3.3828 1.7442 2.2638 1.5138 1.0730 1.3183 1.7643 1.8721 2.7533 2.5826 2.6472 3.9478 5.8455 3.1731 2.6964 2.4593 4.1844 3.2624 6.5711 4.8046 8.1870 6.1464 5.0773 1.2194 1.0877 1.0857 1.0899 1.0904 1.0949 1.0997 1.0972 1.0754 1.0469 1.0997
irintensity: 4.4936 0.4537 0.1760 1.2985 3.1718 3.2210 15.7446 15.5243 14.0313 11.0204 1.2713 2.9628 4.6777 10.5253 0.3421 214.7746 33.7606 8.8713 3.5932 6.9411 10.9214 2.8650 12.4111 2.9597 28.4191 152.1522 94.0290 1.3988 3.6710 0.1190 2.3895 0.2246 4.5159 0.7701 2.4871 0.5542 6.6948 7.0265 5.3942 7.0052 0.7143 33.2776 0.1589 6.4859 0.9135 9.2876 58.8592 25.6406 71.4770 30.8065 36.1610 10.1887 14.2048 37.8476 46.1293 5.3063 17.8004 118.1979 24.0573 63.7625 278.5917 147.6206 10.5523 5.1033 22.8184 2.7021 5.1616 26.6690 27.9899 35.2411 34.8704 21.8633
temp: 298.150 k
press: 1.00000 atm
elementType: 8 7 7 6 6 6 6 6 6 6 6 6 6 6 6 6 1 1 1 1 1 1 1 1 1 1
symmnumber: 1
zpe: 527402.0 jmol-1
zpe.correction: 0.200877 hartree
zpe.thermalcorrener: 0.212957 hartree
zpe.thermalcorrenthalpy: 0.213902 hartree
zpe.thermalcorrgfe: 0.163097 hartree
zpe.sumelectzpe: -685.068978 hartree
zpe.sumelectthermal: -685.056897 hartree
zpe.sumelectthermalent: -685.055953 hartree
zpe.sumelectthermalfe: -685.106758 hartree
dipole: -3.3044 -2.5674 0.9184
dipole: 4.2842
quadrupole: -68.2351 -93.0085 -97.9194
quadrupole: -13.0102 -1.9055 2.9242
quadrupole: 18.1525 -6.6208 -11.5317 -13.0102 -1.9055 2.9242
hfenergy: -685.2698545 hartree
pointgroup: C01[X(C13H10N2O1)]
dipole: -1.3313392 -0.9621111 0.3779706 debye
dipolederiv: -0.687735 -0.2495504 0.0159652 -0.4530126 -1.2932011 0.064701 0.0438142 0.0791302 -0.378889 -0.9855054 -0.6362135 0.078329 -0.0598032 -0.5835206 -0.0153398 0.0687114 -0.0267489 -0.2837193 -0.5581411 0.3378163 0.1623075 0.6547436 -1.012729 0.1688063 0.0026603 0.2459484 -0.5142579 -0.083975 -0.0235703 0.0069297 -0.0230064 0.0358937 0.0172382 0.0234788 0.0242388 0.0160037 0.5173567 0.0457803 0.0007764 -0.1277738 0.061409 -0.0052671 0.0079884 -0.0085864 0.0215194 -0.0347639 0.6197013 -0.0213271 0.2210244 0.4324439 -0.0272551 -0.0841114 0.0022811 0.0400825 -0.1108321 0.2022352 -0.0123469 0.0015062 -0.4188725 0.0246489 -0.0084895 0.0224913 0.004483 0.4975977 -0.6754204 -0.0705784 -0.7540083 0.7877437 -0.0088995 -0.110452 0.0558129 0.0501982 1.3181572 0.4444414 -0.040569 0.281607 1.4601363 -0.0908031 -0.0290919 -0.1011688 0.1870368 -0.08465 -0.0508433 0.0026332 0.1042752 -0.053532 -0.0045577 0.0192755 0.0070213 -0.1885074 -0.347063 0.0567846 -0.0018252 0.1832573 0.0600043 -0.0058509 -0.013633 -0.0045718 -0.1509897 -0.0700964 -0.0992598 0.0093718 0.1741743 0.0865751 -0.0009481 -0.0095708 -0.0129741 -0.1081621 0.0126085 -0.0814756 -0.0213454 0.1366499 -0.1816097 -0.0013571 0.0672718 -0.0756733 -0.2081049 -0.0453653 0.0505664 0.008165 -0.0221895 0.0768334 0.0145339 0.0130761 -0.0015239 -0.1498696 0.1432429 -0.0309962 0.0045575 -0.039763 0.1593072 -0.011812 0.0100593 -0.0098445 -0.1351208 0.0730994 0.0575651 0.0045883 -0.0715504 -0.1883076 0.0036683 0.0092486 0.0037848 -0.171055 0.1799358 0.0226505 -0.0098263 -0.0349944 0.1752669 0.0103899 -0.0135364 0.0246594 0.2978286 0.0535781 0.1124709 0.0006786 0.0690285 -0.0387145 -0.0018019 -0.0171579 -0.0048351 0.1532313 0.0719993 -0.1049339 0.0009369 -0.0588669 -0.0577941 0.0061162 0.0009334 0.0036407 0.145214 0.099949 -0.0166819 -0.0008745 -0.0918364 0.0170784 0.0007221 0.0030062 0.0041472 0.1542724 -0.1531441 0.0057403 0.0147828 0.0368833 0.08151 0.0002962 0.019401 0.0004795 0.1646326 0.0186376 -0.0899882 -0.0042218 -0.1070329 -0.0747718 -0.0079263 -0.0170687 -0.0017506 0.160961 0.005224 0.0961653 -0.0064743 0.1233803 -0.054691 0.0091949 -0.0077715 0.0085464 0.1536701 -0.1346402 -0.0076 -0.0075371 -0.0151695 0.0880797 0.0023139 -0.0073538 0.0025683 0.161149 0.1619878 0.0430964 -0.0821958 -0.0491102 0.2522239 -0.0731525 0.0032733 -0.1864629 0.2457929 0.1425377 -0.0284803 -0.0309002 -0.0784125 0.1832385 -0.0676585 0.0260385 -0.0506098 0.3326001 unknown
polarizability: 246.4841932|2.153331|184.9375455|1.5937508|-1.2980526|62.1506813 unknown
InChI: InChI=1S/C13H10N2O/c14-11-7-3-6-9-8-4-1-2-5-10(8)13(16)15-12(9)11/h1-7,15H,14H2
charge 0 multiplicity 1
26 atoms
O  1.247181 3.021269 -0.210677
N  -0.638197 1.670977 -0.104506
N  -3.427035 1.662635 0.067881
C  -0.555999 -0.777848 -0.028546
C  0.915439 -0.685293 -0.007405
C  -1.304229 0.435428 -0.037486
C  1.546311 0.601639 -0.029067
C  -2.734972 0.429519 0.01731
C  0.752307 1.854044 -0.116124
C  -1.270752 -2.009331 -0.054137
C  1.756715 -1.834928 0.046241
C  2.959714 0.718833 0.001183
C  -3.408054 -0.810537 -0.026675
C  -2.675143 -2.021463 -0.080661
C  3.155919 -1.71009 0.078355
C  3.767382 -0.428241 0.056442
H  -1.194014 2.513954 -0.281815
H  -0.728403 -2.95857 -0.060815
H  1.314572 -2.835449 0.067831
H  3.386041 1.726971 -0.024739
H  -4.504004 -0.830615 0.00415
H  -3.21278 -2.974681 -0.11467
H  3.778875 -2.610552 0.121381
H  4.858378 -0.337768 0.081469
H  -3.107249 2.38317 0.716537
H  -4.434101 1.640928 -0.084557
