program: Gaussian 09
title: 000269086
version: EM64L-G09RevD.01
frameworkgroup: C1[X(C14H8FNO3S)]
method: RPBEPBE
basis: SDD
operation: Freq
keyword: #p
keyword: freq=noraman
keyword: PBEPBE/SDD
title: #p freq=noraman PBEPBE/SDD
converged: YES YES NO NO
title: Mulliken charges:
elementType: S F O O O N C C C C C C C C C C C C C C H H H H H H H H
charge: 0.361324 -0.188633 -0.137828 -0.203026 -0.199215 0.003310 0.282702 0.285055 0.265570 0.223547 -0.288094 -0.282711 -0.598392 -0.497635 0.557273 -0.350323 -0.561696 -0.368378 0.352680 -0.888279 0.264366 0.331709 0.251005 0.309881 0.264918 0.267533 0.267385 0.275953
chargesum: 0.00000
title: Mulliken charges with hydrogens summed into heavy atoms:
elementType: S F O O O N C C C C C C C C C C C C C C
charge: 0.361324 -0.188633 -0.137828 -0.203026 -0.199215 0.003310 0.282702 0.285055 0.265570 0.223547 -0.288094 -0.018345 -0.266682 -0.497635 0.557273 -0.099318 -0.251815 -0.103460 0.352680 -0.077409
polarizability: 3.52955417e+02 6.55405093e+00 2.46458547e+02 -3.02917063e-02 -2.29937611e-02 7.17999275e+01
1716.lowfreq: -5.5969 -3.4078 -2.0936 -0.0016 0.0009 0.0012 36.8792 45.8111 57.6428
frequency: 36.8482 45.8108 57.6412 103.8530 123.6086 137.4965 157.1796 189.2396 192.5395 215.2090 248.6714 259.4164 267.9788 287.5829 315.3214 351.6347 374.0863 381.6559 425.6396 450.0771 470.4315 510.7403 533.4389 554.8583 605.5702 606.5694 619.4730 633.5938 662.3213 664.1477 722.7379 723.2759 742.1152 769.2465 773.0662 820.7708 835.3685 890.0854 898.2973 910.6360 948.4036 954.8818 976.6465 977.2401 981.7097 1026.8928 1074.4126 1087.4986 1130.0584 1149.0894 1189.8596 1198.1672 1236.0288 1242.9713 1267.3631 1337.1905 1345.4324 1356.0256 1383.0064 1398.3896 1437.9609 1451.0938 1459.1379 1460.3488 1482.1063 1580.0372 1599.0548 1603.6805 1621.0404 1640.2854 3007.1039 3131.2578 3132.6160 3146.2067 3175.1555 3176.1878 3178.4007 3180.7613
redmass: 5.1764 12.9677 7.3136 7.1279 6.6396 7.3168 6.4721 3.3565 7.9288 6.8824 7.7007 2.2002 12.6501 1.9820 6.2391 13.1720 6.2485 7.1480 3.4109 3.1282 10.1874 5.7525 6.8723 7.9117 6.2765 5.5690 8.2786 7.3578 7.1906 5.5202 9.4843 7.3508 6.2784 3.2647 9.8564 3.8356 1.4616 1.6076 7.5604 1.6045 1.1911 1.3990 1.5393 1.3992 3.1354 5.3359 2.4231 2.1266 1.5934 4.9019 3.3236 7.5379 3.5186 1.4458 1.7449 1.4203 3.7051 6.1885 3.5849 7.0321 2.8913 2.7970 1.0590 1.2491 4.9420 10.0381 8.2573 8.2430 8.2326 10.5289 1.0289 1.1020 1.1065 1.0907 1.0938 1.0919 1.0911 1.0955
irintensity: 0.6997 0.0256 0.9111 1.3368 0.1452 1.7009 0.0332 3.0821 4.0561 0.6734 3.7304 3.7960 0.1035 0.1375 4.2740 2.6669 0.0311 1.6392 4.6821 0.8344 13.4795 5.8346 7.9261 22.7636 1.6759 13.7680 0.5503 3.8676 3.2649 2.2855 17.0796 1.0911 13.6129 0.2860 7.3111 26.8042 34.2390 9.0895 49.5200 15.2525 7.2040 0.0146 25.5376 6.2938 29.8911 14.7332 0.9124 15.1071 25.2722 14.4268 453.2309 211.9699 74.3770 34.3642 7.8379 15.5440 64.3103 9.6887 10.8148 30.2504 48.5335 164.4499 18.2312 26.9768 12.0762 59.4096 350.5192 60.5147 135.7055 131.6894 16.1840 4.6147 14.3614 4.6955 0.9305 4.2029 7.9029 5.2859
temp: 298.150 k
press: 1.00000 atm
elementType: 16 9 8 8 8 7 6 6 6 6 6 6 6 6 6 6 6 6 6 6 1 1 1 1 1 1 1 1
symmnumber: 1
zpe: 492215.1 jmol-1
zpe.correction: 0.187475 hartree
zpe.thermalcorrener: 0.204063 hartree
zpe.thermalcorrenthalpy: 0.205008 hartree
zpe.thermalcorrgfe: 0.142524 hartree
zpe.sumelectzpe: -1315.161190 hartree
zpe.sumelectthermal: -1315.144601 hartree
zpe.sumelectthermalent: -1315.143657 hartree
zpe.sumelectthermalfe: -1315.206141 hartree
dipole: -2.7162 7.8449 0.0052
dipole: 8.3018
quadrupole: -149.4577 -116.8362 -121.6812
quadrupole: 7.8149 0.0371 0.0270
quadrupole: -20.1326 12.4888 7.6439 7.8149 0.0371 0.0270
hfenergy: -1315.3486648 hartree
pointgroup: C01 [X(C14H8F1N1O3S1)]
dipole: 1.1533701 3.0399691 -0.3103374 debye
polarizability: 352.220162|-8.4167627|244.6094811|10.0234457|-19.8998203|74.3842485 unknown
InChI: InChI=1S/C14H8FNO3S/c1-20-13-6-9-8-3-2-7(15)4-10(8)14(17)11(9)5-12(13)16(18)19/h2-6H,1H3
charge 0 multiplicity 1
28 atoms
S  -3.735376 1.872518 -0.403106
F  5.73109 0.352774 0.078145
O  1.380863 -3.018404 0.314667
O  -3.977259 -2.562718 0.091908
O  -4.88943 -0.488309 -0.168866
N  -3.869283 -1.282585 -0.048477
C  0.08768 0.327969 -0.105543
C  1.55167 0.568471 -0.084984
C  -0.142611 -1.076242 0.045474
C  2.208561 -0.689427 0.078907
C  1.173251 -1.784433 0.168695
C  -0.984222 1.215116 -0.23973
C  -1.437941 -1.586225 0.062234
C  -2.329214 0.730582 -0.228109
C  -2.525938 -0.684586 -0.073967
C  2.306406 1.751852 -0.19433
C  3.605005 -0.798274 0.137523
C  3.7199 1.667771 -0.137998
C  4.328075 0.406676 0.025014
C  -2.857578 3.541127 -0.570798
H  -0.790824 2.28379 -0.353203
H  -1.644264 -2.653897 0.176587
H  1.828517 2.728537 -0.321156
H  4.107594 -1.76121 0.263652
H  4.349388 2.558571 -0.218147
H  -2.224598 3.573765 -1.470933
H  -2.285086 3.787861 0.336573
H  -3.685578 4.258627 -0.683433
