program: Gaussian 09
title: 000269078
version: EM64L-G09RevD.01
frameworkgroup: C1[X(C13H8INO)]
method: RPBEPBE
basis: SDD
operation: Freq
keyword: #p
keyword: freq=noraman
keyword: PBEPBE/SDD
title: #p freq=noraman PBEPBE/SDD
converged: NO YES NO NO
title: Mulliken charges:
elementType: I O N C C C C C C C C C C C C C H H H H H H H H
charge: 0.116209 -0.409669 -0.020365 0.254026 0.207987 0.281338 0.265420 -0.236736 -0.420380 -0.399122 -0.487325 -0.400575 -0.227621 -0.187994 -0.230653 -0.236850 0.252386 0.247096 0.301547 0.236504 0.249266 0.230657 0.232561 0.382291
chargesum: 0.00000
title: Mulliken charges with hydrogens summed into heavy atoms:
elementType: I O N C C C C C C C C C C C C C
charge: 0.116209 -0.027378 -0.020365 0.254026 0.207987 0.281338 0.265420 -0.236736 -0.167994 -0.152027 -0.487325 -0.099027 0.008883 0.061272 0.000004 -0.004289
polarizability: 2.74667845e+02 -1.55475084e+00 2.22782572e+02 -7.06699272e-03 -6.04362821e-03 5.96089631e+01
1716.lowfreq: -5.2057 -0.0008 -0.0006 0.0003 4.8224 9.3445 41.6167 102.0018 108.7170
frequency: 41.6161 101.9964 108.7162 123.1690 170.8899 193.0308 200.4346 233.4914 268.3518 321.1820 372.2233 401.1197 423.9781 441.0499 495.5977 518.7798 523.2621 552.8611 578.6740 623.7663 649.0176 668.3753 732.7872 750.6881 766.3664 778.7234 793.8654 813.7926 879.9651 894.5433 912.2939 947.8316 965.8531 977.7314 996.9586 1001.9682 1030.9774 1060.9947 1083.5324 1130.5686 1150.1375 1172.4233 1195.7602 1220.9376 1277.4784 1300.2639 1313.3936 1368.6493 1386.5094 1420.9982 1442.5751 1456.6223 1469.0734 1561.7194 1572.0188 1590.4750 1611.6236 1617.4397 3128.5795 3136.3835 3142.2618 3154.1951 3160.9901 3173.1379 3201.9180 3556.9696
redmass: 7.6940 11.8809 4.1449 5.2240 5.1456 7.3056 7.5878 5.7726 5.6701 5.6746 8.6366 3.0974 6.9252 2.6609 1.8081 2.5094 6.3244 6.6555 3.9111 7.3669 3.9957 7.0612 6.1809 1.6608 1.6546 6.6432 2.4519 2.7036 9.3750 1.4185 1.4588 7.9868 1.4216 1.3558 1.3411 6.3875 2.3145 2.2508 2.4850 1.9022 1.7739 1.1132 1.6347 1.8054 2.2372 1.6565 1.5458 3.6251 4.1012 2.6004 3.2301 2.8642 3.7720 6.9349 7.4365 7.0824 7.7853 7.2927 1.0861 1.0868 1.0916 1.0935 1.0982 1.0980 1.0950 1.0675
irintensity: 0.0039 0.3087 0.3658 5.2529 0.1426 0.0476 0.1700 3.0744 1.4099 5.4148 4.8544 15.3791 1.3446 7.5445 60.1392 41.2538 1.2613 0.7095 8.2945 9.5111 24.6589 25.9512 5.3763 6.2918 109.9868 28.4207 48.2786 0.0009 150.3038 0.2481 0.6438 38.8164 5.6010 1.4636 0.5924 11.2329 12.5513 10.4274 23.2447 18.9159 26.7560 1.1776 0.8604 10.3613 19.1113 20.3247 51.3476 8.6558 4.0261 41.3066 34.5969 3.4880 2.1388 66.7326 0.8861 1.8354 19.1486 13.7318 1.7733 5.1206 11.4363 9.8453 36.2232 15.3113 5.3128 85.0699
temp: 298.150 k
press: 1.00000 atm
elementType: 53 8 7 6 6 6 6 6 6 6 6 6 6 6 6 6 1 1 1 1 1 1 1 1
symmnumber: 1
zpe: 450475.1 jmol-1
zpe.correction: 0.171577 hartree
zpe.thermalcorrener: 0.184287 hartree
zpe.thermalcorrenthalpy: 0.185231 hartree
zpe.thermalcorrgfe: 0.130994 hartree
zpe.sumelectzpe: -640.545042 hartree
zpe.sumelectthermal: -640.532332 hartree
zpe.sumelectthermalent: -640.531388 hartree
zpe.sumelectthermalfe: -640.585625 hartree
dipole: -1.7971 0.6530 0.0001
dipole: 1.9121
quadrupole: -93.6139 -84.0658 -112.6289
quadrupole: -1.8339 -0.0006 -0.0012
quadrupole: 3.1556 12.7037 -15.8594 -1.8339 -0.0006 -0.0012
hfenergy: -640.7166193 hartree
pointgroup: C01 [X(C13H8I1N1O1)]
dipole: -0.5584756 -0.5039924 -0.0000329 debye
dipolederiv: -0.2041883 -0.237935 0.0000035 -0.3493471 -0.3098417 -0.0000189 -0.0000948 -0.0000726 0.009701 -0.6032545 1.1237772 -0.000049 0.4119149 -0.8296088 0.0000251 -0.0000132 0.0000699 -0.3495986 0.1402106 -0.9578342 0.0000374 -0.201762 0.557519 -0.0000284 0.0000351 -0.0000585 -0.1436002 0.2619131 -0.2713752 0.0000183 0.1120637 0.0690951 0.0000053 0.0000423 0.0000042 -0.0016999 0.2101427 0.2069892 0.0000072 -0.0912674 -0.076984 0.0000009 0.0000428 0.000034 0.0044233 -0.4573864 -0.225238 -0.0000143 -0.4740619 -0.1540548 -0.0000335 -0.0000687 -0.000046 0.0727079 -0.3269809 0.052009 -0.0000166 0.118334 -0.0087102 0.0000057 0.0000492 0.0000515 0.0778808 0.5960087 0.0914796 0.0000304 -0.0305287 -0.138185 0.0000085 -0.0000282 -0.0000233 0.0008573 -0.237825 0.1382502 -0.0000103 0.1005367 -0.0096314 -0.0000004 -0.0000954 -0.0000569 -0.1586478 -0.2346227 -0.1786299 -0.000001 -0.0069973 0.1029971 -0.0000081 0.0000193 0.0000039 -0.1612667 0.5123194 0.5082283 0.0000129 0.8410436 0.7765016 0.0000413 0.0001548 0.0001099 -0.1519382 0.0274713 -0.0188082 0.0000057 -0.1073882 0.0581489 -0.0000115 0.0000033 -0.0000085 -0.1393633 0.1614997 -0.007263 0.0000161 -0.0797869 0.0392158 -0.0000026 0.0000183 -0.0000049 -0.1341084 -0.1544539 -0.1865338 -0.0000019 -0.1658893 -0.3106844 -0.0000057 -0.0000148 -0.0000175 -0.1233698 0.0877316 0.1261217 0.0000054 0.1017012 -0.0282139 0.0000008 -0.0000235 -0.0000172 -0.1403599 0.0364515 -0.039622 0.0000102 -0.0791826 -0.0315979 -0.0000036 -0.0000054 -0.0000165 -0.1769977 0.0543247 -0.1057996 -0.0000025 -0.0630738 -0.0509703 0.0000015 0.000028 0.0000204 0.1567705 0.0857009 0.0769165 -0.0000046 0.0238936 -0.0864224 0.0000063 -0.0000069 0.0000051 0.1552217 0.1094738 0.0016655 -0.0000032 0.0590007 0.0013157 0.0000071 0.000026 0.0000226 0.1731639 -0.0037978 0.0817539 -0.0000082 0.0877312 -0.0678087 0.0000073 -0.0000003 0.000016 0.1618832 -0.0653115 0.004997 -0.0000135 -0.0225054 0.1029086 0.0000005 -0.0000035 0.000008 0.1613608 -0.0542068 -0.1079292 -0.0000065 -0.1226057 -0.007058 -0.0000016 -0.0000266 -0.0000137 0.1588273 -0.1265677 0.0383042 -0.0000131 0.0594614 0.0725116 0.0000041 -0.0000035 0.0000095 0.1624521 0.1853475 -0.1135241 -0.0000022 -0.1212846 0.3295581 -0.0000002 -0.0000342 -0.0000193 0.3857005 unknown
polarizability: 266.2426159|19.1983874|231.2078014|0.0088213|-0.0029415|59.6089631 unknown
InChI: InChI=1S/C13H8INO/c14-11-7-3-6-9-8-4-1-2-5-10(8)13(15-16)12(9)11/h1-7,16H
charge 0 multiplicity 1
24 atoms
I  3.54788 2.166138 0.000322
O  -1.004553 3.283446 0.000048
N  0.222731 2.501152 0.000127
C  0.468785 -1.109709 0.000221
C  -0.998538 -0.950176 0.000148
C  1.071116 0.198303 0.000222
C  -1.312562 0.446353 0.000105
C  -0.034283 1.201128 0.000153
C  1.248534 -2.278664 0.000284
C  -2.021003 -1.917112 0.000121
C  2.478336 0.298975 0.000292
C  -2.65589 0.879936 0.000035
C  2.657045 -2.153853 0.000351
C  3.269422 -0.879117 0.000356
C  -3.368555 -1.480428 0.000052
C  -3.680823 -0.098415 0.00001
H  0.779601 -3.267855 0.00028
H  -1.788083 -2.987527 0.000151
H  -2.892906 1.944512 0.000002
H  3.290591 -3.047197 0.000402
H  4.360169 -0.800446 0.000409
H  -4.178574 -2.218189 0.00003
H  -4.72953 0.2183 -0.000042
H  -0.659512 4.213347 0.000018
