program: Gaussian 09
title: 000269077
version: EM64L-G09RevD.01
frameworkgroup: C1[X(C13H7IO)]
method: RPBEPBE
basis: SDD
operation: Freq
keyword: #p
keyword: freq=noraman
keyword: PBEPBE/SDD
title: #p freq=noraman PBEPBE/SDD
converged: NO YES NO NO
title: Mulliken charges:
elementType: I O C C C C C C C C C C C C C H H H H H H H
charge: 0.141411 -0.137222 0.323940 0.274478 0.261846 0.240185 -0.274800 -0.416287 -0.387766 -0.493259 -0.419832 -0.213490 -0.198055 -0.219122 -0.228633 0.251946 0.246732 0.282875 0.238363 0.255627 0.232953 0.238111
chargesum: 0.00000
title: Mulliken charges with hydrogens summed into heavy atoms:
elementType: I O C C C C C C C C C C C C C
charge: 0.141411 -0.137222 0.323940 0.274478 0.261846 0.240185 -0.274800 -0.164341 -0.141034 -0.493259 -0.136958 0.024873 0.057572 0.013831 0.009478
polarizability: 2.71663345e+02 -5.21167581e+00 1.91479910e+02 1.43345115e-02 -1.80842342e-03 5.60428408e+01
1716.lowfreq: -5.0636 -0.0003 0.0004 0.0005 5.3666 10.7251 54.1398 101.3176 107.0492
frequency: 54.1280 101.3151 107.0482 146.5345 184.4220 204.8245 248.5836 273.0366 300.4852 413.1137 416.8570 441.3409 491.6676 516.8620 555.1741 579.8413 626.9265 646.7975 669.9523 737.1369 749.0578 768.3246 776.8415 806.9303 842.1628 898.3972 900.5610 915.0504 969.3329 984.7421 999.0185 1001.5904 1026.0999 1049.9815 1080.6943 1123.3261 1145.9164 1169.5579 1186.5770 1204.0793 1263.2149 1291.9727 1364.2491 1380.2094 1425.7149 1441.4784 1451.9357 1470.4106 1566.3486 1591.0236 1604.3587 1612.9247 1637.8065 3130.4934 3136.6450 3143.0035 3153.5658 3154.6497 3168.8678 3171.9932
redmass: 9.3864 11.3965 4.2870 5.8820 4.6754 8.2385 7.2885 4.9139 7.9360 3.3860 7.2457 3.9965 4.0777 6.1107 8.7924 4.0020 7.4128 7.0545 4.0680 6.5826 1.7275 1.4648 6.7786 1.8992 4.0863 7.4903 1.5017 1.4535 1.4504 1.3648 1.3558 5.0938 2.5130 2.4766 2.4246 2.2774 1.9355 1.1911 1.8524 1.4985 2.1785 1.7140 9.0657 2.4398 2.3413 3.5706 2.5524 4.1639 7.5725 7.5304 7.1647 7.7770 11.0059 1.0864 1.0870 1.0901 1.0938 1.0942 1.1003 1.0981
irintensity: 2.5094 0.5501 1.7765 0.0649 0.4692 0.0262 4.6893 0.2326 1.1010 0.0281 1.3752 4.9815 0.8869 5.1081 2.5116 5.6077 11.1449 14.6920 14.9436 13.1668 2.7300 126.4157 25.9214 19.0217 3.7628 42.7311 0.0849 0.6739 3.6104 1.2231 0.0291 14.8365 17.1721 4.7172 25.0915 18.8391 11.0082 8.4616 27.2814 33.0839 33.9397 11.0573 4.8254 2.3566 67.5046 13.2522 9.8135 8.3429 93.4794 119.9432 3.9485 85.3443 76.3542 2.3638 4.4417 4.6525 0.4716 22.2178 32.4748 13.6296
temp: 298.150 k
press: 1.00000 atm
elementType: 53 8 6 6 6 6 6 6 6 6 6 6 6 6 6 1 1 1 1 1 1 1
symmnumber: 1
zpe: 409572.4 jmol-1
zpe.correction: 0.155998 hartree
zpe.thermalcorrener: 0.167422 hartree
zpe.thermalcorrenthalpy: 0.168366 hartree
zpe.thermalcorrgfe: 0.116790 hartree
zpe.sumelectzpe: -585.322824 hartree
zpe.sumelectthermal: -585.311400 hartree
zpe.sumelectthermalent: -585.310456 hartree
zpe.sumelectthermalfe: -585.362032 hartree
dipole: 3.1812 3.7510 -0.0001
dipole: 4.9183
quadrupole: -80.1096 -90.7439 -105.1041
quadrupole: -2.1394 0.0022 0.0017
quadrupole: 11.8763 1.2420 -13.1182 -2.1394 0.0022 0.0017
hfenergy: -585.4788219 hartree
pointgroup: C01[X(C13H7I1O1)]
dipole: 0.6896016 1.8079571 -0.0000327 debye
dipolederiv: -0.2315189 -0.2574529 -0.0000198 -0.4278164 -0.2939931 -0.0000311 -0.0000027 -0.0001687 0.0311883 -0.5361913 -0.0668229 -0.0000284 0.1040117 -0.8672009 -0.0002096 -0.00001 0.0002923 -0.2808351 0.2596458 -0.1709268 0.0000114 -0.0697396 0.1624206 -0.0000071 0.0000479 -0.0002487 0.0162957 0.236392 0.0884839 0.0000111 -0.053966 -0.0151909 0.0000356 -0.0000512 0.0001434 -0.0026319 -0.997638 0.076658 -0.0000092 0.0641572 -0.5025039 0.0000294 0.0000914 -0.0000493 0.0596798 -0.6856425 -0.1856046 -0.0000517 -0.0242385 -0.1777998 0.0000623 -0.0002052 -0.0000658 0.0335653 1.4431331 0.1338628 0.0000602 -0.311986 1.032826 0.000104 0.0000702 -0.0001651 0.1228584 -0.3648096 0.1368691 -0.0000355 0.2066147 -0.0232006 -0.0000086 0.0001433 0.0002294 -0.1577814 -0.3511098 -0.0959966 0. 0.0234359 0.1251307 -0.0000004 -0.0000665 -0.0000768 -0.1471466 0.7818574 0.4426862 0.0000241 0.9529215 0.8517338 0.0000975 0.000077 0.0002862 -0.1370738 0.0833381 0.0487837 0.0000891 -0.1553778 0.1447103 -0.0000778 -0.0000285 -0.0000698 -0.1156052 0.2714946 0.0300598 0.0000058 -0.0645219 0.1377658 0.0000007 -0.0000651 -0.0000475 -0.11248 -0.1291427 -0.1956876 -0.0000382 -0.2390621 -0.4473309 -0.0000238 0.0000399 0.0000373 -0.1238454 0.166954 0.0916666 0.0000615 0.0646166 0.0150911 0.0000257 0.0000852 0.0000576 -0.128702 0.0416622 -0.0687494 0.0000474 -0.0812189 -0.1052692 -0.0000502 0.0000198 -0.0000629 -0.1710974 0.0419412 -0.1071868 0.0000166 -0.0691544 -0.0347395 0.0000059 -0.0000601 -0.0000571 0.1571548 0.0916806 0.0552419 -0.0000133 0.0027565 -0.0874652 -0.0000111 0.0000142 -0.0000221 0.1544337 0.1019351 -0.0098375 -0.0000223 0.0464512 -0.0297843 0.000057 -0.0000083 0.00001 0.1602113 0.0162467 0.0717226 -0.000008 0.0818796 -0.0733938 0.0000023 -0.0000055 -0.0000626 0.1575201 -0.0639696 0.0166898 -0.0000067 -0.0112735 0.1023354 -0.0000007 -0.0000087 0.0000006 0.1625212 -0.0685562 -0.0944848 -0.0000371 -0.1108913 0.0205671 -0.0000058 -0.0000645 -0.000025 0.1561898 -0.1077023 0.0600254 -0.0000569 0.0724016 0.0652914 0.0000059 -0.0000126 0.0000646 0.1655805 unknown
polarizability: 266.0655558|21.0873486|197.0776985|0.0141201|0.0030612|56.0428408 unknown
InChI: InChI=1S/C13H7IO/c14-11-7-3-6-9-8-4-1-2-5-10(8)13(15)12(9)11/h1-7H
charge 0 multiplicity 1
22 atoms
I  -3.610618 -2.12674 -0.000158
O  -0.274689 -2.670057 0.000257
C  -0.351504 0.942019 -0.000057
C  1.107096 0.655601 0.000023
C  -1.063564 -0.303309 -0.000091
C  1.291476 -0.755889 0.000037
C  -0.052387 -1.430223 -0.000357
C  -1.038301 2.165523 0.000025
C  2.221648 1.512591 0.000198
C  -2.466839 -0.30934 -0.000005
C  2.569315 -1.335344 0.000266
C  -2.457755 2.143304 0.000083
C  -3.172656 0.924314 0.000076
C  3.519129 0.933488 0.000393
C  3.695335 -0.472293 0.000435
H  -0.501798 3.119874 0.000097
H  2.106622 2.602013 0.000235
H  2.682637 -2.424247 0.000247
H  -3.017741 3.084837 0.000162
H  -4.266441 0.929705 0.000117
H  4.399396 1.586024 0.000539
H  4.707039 -0.891456 0.000579
