program: Gaussian 09
title: 000269066
version: EM64L-G09RevD.01
frameworkgroup: C1[X(C15H16N2O)]
method: RPBEPBE
basis: SDD
operation: Freq
keyword: #p
keyword: freq=noraman
keyword: PBEPBE/SDD
title: #p freq=noraman PBEPBE/SDD
converged: YES YES NO NO
title: Mulliken charges:
elementType: O N N C C C C C C C C C C C C C C C H H H H H H H H H H H H H H H H
charge: -0.278977 -0.478044 -0.704359 0.321104 0.312695 0.361697 -0.554107 0.350472 -0.632317 -0.860301 -0.854177 0.127963 0.242065 -0.357769 -0.345979 -0.239900 -0.225157 -0.231264 0.308864 0.216275 0.330397 0.229195 0.224963 0.243396 0.221020 0.221018 0.251229 0.322070 0.301806 0.211600 0.274755 0.227607 0.230931 0.231228
chargesum: 0.00000
title: Mulliken charges with hydrogens summed into heavy atoms:
elementType: O N N C C C C C C C C C C C C C C C
charge: -0.278977 -0.147647 -0.080482 0.321104 0.312695 0.361697 -0.245243 0.350472 -0.416042 -0.162747 -0.160910 0.127963 0.242065 -0.146168 -0.071224 -0.012293 0.005774 -0.000036
polarizability: 3.40051905e+02 2.05215883e+00 1.87695531e+02 3.17133056e+00 6.95319454e+00 8.54196964e+01
1716.lowfreq: -6.7474 -4.1172 -1.4746 -0.0010 -0.0008 -0.0006 26.4680 36.5606 61.7027
frequency: 26.3764 36.3999 61.6946 78.7608 111.7936 148.7574 161.4303 172.5366 182.6550 220.9268 237.1763 261.8110 298.5837 304.4110 310.0448 320.2744 358.7110 394.3410 402.0269 422.4613 444.4657 447.0846 475.9495 520.7337 550.1310 612.0305 617.9445 640.7640 661.5991 681.7802 686.6108 702.0782 730.9406 740.9533 787.2545 826.4405 849.0119 852.3676 883.9013 930.3669 932.8855 980.7562 981.7381 988.6793 1003.4144 1007.1273 1022.7956 1039.6495 1046.1551 1047.4876 1066.9555 1085.2499 1131.1595 1172.6042 1190.4367 1197.9350 1229.0938 1251.6669 1284.1735 1314.9311 1350.2846 1381.8905 1384.5889 1394.4177 1396.2862 1427.6034 1432.2489 1459.1398 1474.3354 1477.4591 1480.1317 1484.0789 1503.6288 1530.4849 1571.1785 1591.7365 1603.7117 1609.1024 1632.4452 1645.8429 2949.0438 2951.5498 3014.4521 3019.3688 3084.3455 3090.4815 3110.6118 3111.3880 3130.2267 3142.9833 3157.4580 3168.8931 3176.1891 3545.8844 3572.7800 3713.2213
redmass: 4.3030 4.5235 4.8258 4.9202 3.2959 2.9321 2.1724 1.2733 1.4924 3.1344 3.7234 2.4636 2.4812 1.4807 3.6498 4.3172 1.3479 2.7055 2.8244 5.6711 3.8188 3.2912 4.1566 3.4640 4.7669 2.8953 2.3390 2.4082 4.7551 5.3271 4.4979 1.5672 3.1144 5.8754 2.3059 3.9612 1.5118 1.2636 4.1210 1.4243 1.3464 1.4144 1.5646 5.3919 1.3423 1.4630 2.5620 1.5245 1.5014 1.4875 3.5084 1.6321 3.2627 1.0589 1.1241 2.2519 2.1464 2.6376 1.4077 1.3626 4.4729 4.1555 5.2835 1.5837 1.2317 3.3389 2.2591 1.5533 1.0458 1.6172 1.0781 1.4047 1.7000 2.8384 6.0027 5.2485 5.3169 6.0777 1.5965 2.5728 1.0399 1.0399 1.0974 1.0978 1.0947 1.0948 1.0907 1.0875 1.0866 1.0920 1.0955 1.1003 1.0926 1.0751 1.0448 1.1037
irintensity: 1.2227 1.9473 1.3064 1.4969 1.0190 5.4445 4.0989 0.6392 0.3481 3.4561 2.0928 9.6085 37.8527 214.0193 7.9158 7.8478 16.1647 6.3407 0.0202 0.8354 5.7557 11.6329 4.8110 2.3761 13.6053 12.2778 15.8641 13.4160 15.6863 19.1975 6.2765 90.9232 1.3521 1.3181 22.3836 0.7976 25.3676 0.8225 13.6707 0.9601 22.3091 2.3592 16.8067 0.0443 2.3220 13.7947 17.5695 3.3472 12.6656 8.6619 13.3832 12.4113 2.7356 1.1991 5.6637 0.7639 10.1359 92.1387 6.7975 3.0858 56.0042 22.7449 12.5870 39.2121 1.1627 121.4097 2.0369 121.6762 13.1854 10.2869 15.8482 74.9061 16.5586 341.3145 93.9492 2.3467 67.3538 2.9246 20.8104 273.2415 66.0727 27.2419 29.8300 24.1793 19.5262 10.5354 38.3248 11.4816 0.3714 24.5698 18.7939 25.9088 6.7208 16.3086 98.7478 21.0640
temp: 298.150 k
press: 1.00000 atm
elementType: 8 7 7 6 6 6 6 6 6 6 6 6 6 6 6 6 6 6 1 1 1 1 1 1 1 1 1 1 1 1 1 1 1 1
symmnumber: 1
zpe: 723130.3 jmol-1
zpe.correction: 0.275426 hartree
zpe.thermalcorrener: 0.292513 hartree
zpe.thermalcorrenthalpy: 0.293457 hartree
zpe.thermalcorrgfe: 0.230264 hartree
zpe.sumelectzpe: -764.672205 hartree
zpe.sumelectthermal: -764.655118 hartree
zpe.sumelectthermalent: -764.654174 hartree
zpe.sumelectthermalfe: -764.717367 hartree
dipole: 1.8355 3.7389 -0.2177
dipole: 4.1708
quadrupole: -69.9007 -99.5868 -112.7309
quadrupole: -2.8328 1.0795 1.8991
quadrupole: 24.1721 -5.5140 -18.6581 -2.8328 1.0795 1.8991
hfenergy: -764.9476312 hartree
pointgroup: C01 [X(C15H16N2O1)]
dipole: 0.7407976 -1.2048701 -0.8319528 debye
polarizability: 338.7072356|11.0946917|145.8859106|-15.3155037|50.1736599|128.5739866 unknown
InChI: InChI=1S/C15H16N2O/c1-10-9-14(11(2)8-13(10)16)17-15(18)12-6-4-3-5-7-12/h3-9,17H,16H2,1-2H3
charge 0 multiplicity 1
34 atoms
O  -0.856514 1.544391 1.241236
N  -0.243692 -0.329523 -0.042442
N  5.413835 0.001417 -0.32711
C  1.178896 -0.217199 -0.089214
C  1.905319 -1.239924 -0.774097
C  3.284268 0.95795 0.442673
C  1.880046 0.862432 0.508723
C  4.017908 -0.060733 -0.242418
C  3.309277 -1.140728 -0.83658
C  1.19389 -2.413886 -1.429364
C  4.01397 2.121263 1.088429
C  -1.1715 0.51759 0.555839
C  -2.616932 0.124763 0.357848
C  -3.080185 -0.67614 -0.720799
C  -3.557736 0.629129 1.292617
C  -4.452808 -0.985731 -0.843782
C  -4.927201 0.317246 1.171642
C  -5.379683 -0.496264 0.105493
H  1.303126 1.627768 1.032448
H  3.871534 -1.923427 -1.362353
H  -0.625858 -1.17067 -0.476902
H  0.616878 -3.016023 -0.698304
H  0.493585 -2.086934 -2.225178
H  1.920122 -3.095257 -1.902294
H  4.727618 1.780536 1.866689
H  4.590107 2.710764 0.345784
H  3.303604 2.809658 1.574133
H  5.928716 0.768441 0.092288
H  5.935767 -0.722061 -0.81188
H  -2.390672 -1.028091 -1.498929
H  -3.186203 1.270713 2.098192
H  -4.800068 -1.595294 -1.685429
H  -5.642093 0.708211 1.904005
H  -6.444224 -0.736585 0.008137
