program: Gaussian 09
title: 000269118
version: EM64L-G09RevD.01
frameworkgroup: C1[X(C17H19N5)]
method: RPBEPBE
basis: SDD
operation: Freq
keyword: #pfreq=noraman
keyword: PBEPBE/SDD
title: #p freq=noraman PBEPBE/SDD
converged: YES YES NO NO
title: Mulliken charges:
elementType: N N N N N C C C C C C C C C C C C C C C C C H H H H H H H H H H H H H H H H H H H
charge: -0.184197 -0.087297 -0.044029 -0.372415 -0.086030 -0.033143 -0.458822 -0.442363 -0.409227 -0.438139 0.130569 -0.242981 -0.152777 0.224559 -0.386535 -0.519615 0.487287 -0.445048 -0.371543 -0.218297 -0.226499 -0.242572 0.208175 0.221773 0.251630 0.241350 0.216896 0.197181 0.223280 0.244624 0.215987 0.267306 0.329653 0.241420 0.223859 0.276204 0.230913 0.248008 0.225967 0.226104 0.228782
chargesum: 0.00000
title: Mulliken charges with hydrogens summed into heavy atoms:
elementType: N N N N N C C C C C C C C C C C C C C C C C
charge: -0.184197 -0.087297 -0.044029 -0.042762 -0.086030 0.175033 0.014580 0.015883 0.011235 0.022472 0.130569 0.024325 -0.152777 0.224559 -0.145115 -0.019551 0.487287 -0.214134 -0.123535 0.007670 -0.000395 -0.013790
polarizability: 3.23815998e+02 -3.17209176e-01 1.76303514e+02 1.24525968e+01 -2.26753191e+00 1.59223711e+02
1716.lowfreq: -8.2552 -4.4232 -0.8287 -0.0007 -0.0004 0.0003 10.8176 21.8540 27.7143
frequency: 9.4697 21.7659 27.5414 38.7502 44.2534 68.5723 114.1288 131.7679 166.2630 187.6185 217.8753 222.5584 249.9871 262.0726 292.1404 340.3687 403.5614 405.7169 412.9592 462.5388 484.4284 514.1777 547.1230 562.8958 577.0404 615.7210 616.5315 631.5955 642.6842 658.0350 671.9024 704.9248 706.3684 732.9357 751.2509 789.5864 810.5901 816.7221 819.4708 852.0802 853.0614 854.6184 889.1391 907.1484 911.7148 924.5758 926.8836 948.0231 955.8922 977.8786 989.4904 991.9274 1000.2596 1025.4574 1025.9817 1050.9380 1072.5926 1085.0156 1092.6575 1122.5064 1124.1882 1159.0692 1171.9534 1186.5154 1197.9122 1201.0440 1212.7588 1213.7556 1228.9406 1240.9366 1256.6933 1278.7449 1291.6465 1298.9364 1310.6363 1311.5957 1313.0489 1316.2105 1319.3807 1347.9978 1354.6985 1372.7063 1385.6193 1387.3270 1429.5514 1438.2423 1445.5284 1460.4758 1465.4154 1467.5336 1472.6539 1480.1685 1486.5340 1490.1412 1538.0803 1594.5910 1612.2986 1615.5003 2974.7996 2984.8682 3002.3834 3010.5918 3014.7190 3022.9656 3041.0834 3062.8613 3072.6665 3082.4607 3091.9513 3114.9501 3124.4806 3136.2664 3147.1869 3158.2806 3163.4234 3225.5098 3543.1718
redmass: 4.5158 4.1472 4.6723 3.4235 3.5652 3.5671 3.7993 5.7080 4.0785 3.8961 5.3257 4.7219 2.0101 2.9802 5.0906 4.5029 2.8205 4.3610 2.9154 3.0465 3.6092 6.3856 2.2237 3.5726 3.2887 2.9770 5.9464 1.4475 4.4913 5.7147 6.0447 1.8800 3.0510 5.5295 1.7180 3.8729 3.7095 1.8231 1.9000 4.7692 1.9694 1.3071 3.8504 2.2950 1.3709 1.7661 1.4331 1.7459 3.7919 1.3919 3.7663 1.9349 1.6735 1.4670 2.0911 2.0277 2.3474 2.1454 2.6331 3.3660 2.3385 1.7169 1.0537 1.1100 1.7248 2.0243 2.4961 1.4616 1.3513 1.3542 2.7121 1.2977 1.3306 3.8173 1.4899 1.3575 1.3935 2.1546 1.9745 1.4500 2.8600 2.2104 1.8035 4.0350 2.7906 2.1974 2.1443 1.0931 1.0914 1.0875 1.2365 1.1078 1.9178 3.5855 6.6040 6.1614 5.8660 5.9690 1.0639 1.0648 1.0683 1.0623 1.0617 1.0799 1.0969 1.0976 1.1019 1.1042 1.1046 1.0871 1.0860 1.0913 1.0961 1.0917 1.1015 1.0980 1.0773
irintensity: 0.0464 0.2388 1.2035 0.3387 0.6370 0.4592 1.9031 1.8623 1.0378 1.1557 1.8494 0.3516 2.3525 1.9276 0.4928 0.6049 2.2617 1.0129 5.9181 5.1218 13.9761 13.6242 3.2230 5.1162 18.2123 7.2977 0.4798 76.8417 42.0007 13.0718 9.7240 43.3075 10.8647 4.7012 52.0233 20.0371 8.8491 23.9552 13.0786 6.0425 3.9381 0.5400 12.6868 1.5866 2.1426 1.4276 11.1823 22.6161 11.9745 0.1619 0.9499 3.4899 3.9811 0.5734 18.2632 11.0661 22.6589 2.6840 4.8182 3.1861 7.3032 4.1717 0.0744 3.9359 36.7598 13.2672 3.2910 4.6162 0.3012 136.5148 1.7336 1.0144 6.1877 45.4234 6.0511 0.8979 2.2626 35.1615 34.8363 29.3064 151.2295 4.7212 5.7541 10.7644 54.4124 76.8999 15.8768 6.4452 15.8694 6.9976 22.8219 16.0463 9.2876 6.0317 84.0654 29.1147 670.0350 74.2086 61.7268 50.3970 11.9146 44.8948 24.5837 31.4906 15.9156 30.6663 19.2114 9.0875 83.2379 8.6899 0.8394 15.4631 43.8925 19.6814 24.5196 0.2948 62.7150
temp: 298.150 k
press: 1.00000 atm
elementType: 7 7 7 7 7 6 6 6 6 6 6 6 6 6 6 6 6 6 6 6 6 6 1 1 1 1 1 1 1 1 1 1 1 1 1 1 1 1 1 1 1
symmnumber: 1
zpe: 883115.5 jmol-1
zpe.correction: 0.336361 hartree
zpe.thermalcorrener: 0.354788 hartree
zpe.thermalcorrenthalpy: 0.355732 hartree
zpe.thermalcorrgfe: 0.285613 hartree
zpe.sumelectzpe: -931.404089 hartree
zpe.sumelectthermal: -931.385662 hartree
zpe.sumelectthermalent: -931.384718 hartree
zpe.sumelectthermalfe: -931.454837 hartree
dipole: 1.4185 -1.7631 -0.3663
dipole: 2.2923
quadrupole: -104.2933 -131.7775 -126.4042
quadrupole: -6.1163 1.2089 -3.7723
quadrupole: 16.5317 -10.9525 -5.5792 -6.1163 1.2089 -3.7723
hfenergy: -931.7404502 hartree
pointgroup: C01 [X(C17H19N5)]
dipole: -0.5417938 0.7203302 0.0307413 debye
polarizability: 323.4622273|-0.619369|174.2869996|-14.4688188|6.1922381|161.5939957 unknown
InChI: InChI=1S/C17H19N5/c1-2-6-13(7-3-1)10-18-16-15-17(20-11-19-16)22(12-21-15)14-8-4-5-9-14/h1-3,6-7,11-12,14,18H,4-5,8-10H2
charge 0 multiplicity 1
41 atoms
N  -2.777904 1.1059 -0.243402
N  -0.721798 1.974478 -0.810013
N  -2.144956 -1.305339 -0.054706
N  1.716437 0.121931 -1.10671
N  0.244409 -1.660664 -0.533565
C  -4.226042 1.06863 0.068402
C  -4.520044 0.564292 1.517047
C  -5.048478 0.131536 -0.887947
C  -5.867961 -0.18605 1.3924
C  -5.726315 -0.919005 0.033585
C  -1.891292 0.021782 -0.286435
C  -2.019431 2.241393 -0.56508
C  -0.632332 0.581998 -0.638022
C  0.46581 -0.322733 -0.764449
C  -1.019833 -2.065651 -0.198479
C  2.880901 -0.757216 -1.285321
C  4.078203 -0.343376 -0.434904
C  5.379232 -0.323173 -0.994603
C  3.914859 -0.006219 0.933203
C  6.500179 0.017345 -0.202976
C  5.031939 0.337962 1.725023
C  6.329732 0.349338 1.160248
H  -4.571549 2.11284 -0.043975
H  -4.532748 1.389486 2.250371
H  -3.731438 -0.150076 1.812407
H  -4.395836 -0.337395 -1.642767
H  -5.806167 0.730231 -1.426337
H  -6.712297 0.531159 1.357226
H  -6.046477 -0.873474 2.237743
H  -5.052152 -1.7860 0.153431
H  -6.690523 -1.27706 -0.368067
H  -2.466919 3.232781 -0.605017
H  1.820747 1.128557 -1.254106
H  -1.139661 -3.139551 -0.024455
H  3.175768 -0.78439 -2.353528
H  2.534151 -1.771491 -1.013988
H  5.516975 -0.574605 -2.054046
H  2.910144 -0.014482 1.371591
H  7.500878 0.028935 -0.6496
H  4.892964 0.595374 2.781233
H  7.196328 0.617104 1.775093
