program: Gaussian 09
title: 000269055
version: EM64L-G09RevD.01
frameworkgroup: C1[X(C20H15NO)]
method: RPBEPBE
basis: SDD
operation: Freq
keyword: #p
keyword: freq=noraman
keyword: PBEPBE/SDD
title: #p freq=noraman PBEPBE/SDD
converged: NO YES NO NO
title: Mulliken charges:
elementType: O N C C C C C C C C C C C C C C C C C C C C H H H H H H H H H H H H H H H
charge: -0.257612 -0.445806 0.408211 0.234729 0.214444 0.086233 0.233728 0.301261 -0.749749 0.452978 -0.418581 -0.528118 -0.376232 -0.363747 -0.324206 -0.445843 -0.269100 -0.286602 -0.267404 -0.251779 0.215580 -0.803297 0.301724 0.222740 0.234557 0.228031 0.192730 0.243651 0.241561 0.309986 0.231774 0.231046 0.229391 0.228581 0.237435 0.270264 0.237442
chargesum: 0.00000
title: Mulliken charges with hydrogens summed into heavy atoms:
elementType: O N C C C C C C C C C C C C C C C C C C C C
charge: -0.257612 -0.135820 0.408211 0.234729 0.214444 0.086233 0.233728 0.301261 -0.448025 0.452978 -0.195841 -0.293561 -0.148201 -0.171016 -0.080555 -0.204281 -0.037326 -0.055557 -0.038013 -0.023198 0.215580 -0.058156
polarizability: 3.86180883e+02 2.95746574e+01 2.93972790e+02 2.83662808e-04 -1.84162798e-03 9.00114832e+01
1716.lowfreq: -81.9620 -0.0010 -0.0003 0.0005 6.6519 12.8330 14.2215 37.9812 50.0310
frequency: -81.9606 37.9265 50.0041 68.0656 84.8117 99.7577 126.6649 179.0624 193.2100 199.5161 248.1715 270.5902 297.2459 307.8217 338.4076 394.6939 419.3963 431.0261 469.7006 483.5807 503.5395 517.5199 552.3031 556.1256 562.1707 564.6547 583.5868 607.4810 622.9322 644.8050 668.0250 680.8782 697.7370 748.0693 763.1997 765.0504 782.7635 807.5123 812.0241 837.5462 866.9422 879.0360 885.4562 897.4548 921.4237 943.8497 960.3043 961.3658 977.5480 979.5134 987.0509 994.6114 1015.7333 1030.5834 1040.8235 1052.6523 1070.3721 1114.2326 1159.6757 1166.0873 1181.3732 1190.1086 1222.6051 1238.9032 1250.4974 1253.0478 1272.8061 1280.0805 1307.0028 1364.9572 1376.2000 1384.2509 1399.6973 1408.9186 1415.2512 1435.4411 1445.3641 1449.3865 1455.8816 1468.2134 1469.1111 1512.7537 1527.6291 1545.1958 1575.8462 1605.7093 1611.0388 1622.5560 1627.2103 1635.8777 2987.2461 3072.3902 3108.8878 3120.5074 3125.2941 3135.0637 3136.3273 3137.1532 3152.2305 3153.2811 3162.9760 3166.7258 3174.0242 3207.5622 3551.3142
redmass: 1.0619 3.9379 6.1059 4.4837 3.6548 5.2329 3.5701 4.1947 4.4213 4.2152 8.0758 3.9412 4.0861 7.5709 3.8320 4.8757 3.2093 2.9044 4.8340 3.5571 5.8665 5.5613 2.6483 5.7692 3.0263 7.6048 3.0665 1.5116 5.8320 2.6526 5.8989 6.0022 3.2514 1.3275 6.0228 1.4496 2.0549 5.2230 1.8099 1.4564 6.2427 4.2035 2.0594 1.9775 4.9409 1.4082 1.4990 1.6046 1.9009 1.5560 1.3510 1.3473 5.1764 1.6522 2.2279 2.4171 3.0615 2.2780 1.6138 1.3525 1.1456 1.1155 2.2755 2.1320 1.8942 1.6085 1.7093 2.6262 1.8979 2.6684 1.2348 4.5267 3.6762 4.1754 2.8511 3.0382 1.6851 2.0479 2.2370 1.0467 1.9407 2.9672 3.8206 2.7903 7.6544 6.3356 6.4746 7.0288 6.1769 4.1349 1.0384 1.0985 1.0863 1.0868 1.0880 1.0889 1.0879 1.0977 1.0945 1.0944 1.0967 1.0996 1.0950 1.0904 1.0753
irintensity: 0.0063 2.4488 8.2116 2.1674 0.0648 3.8805 0.0205 0.4715 0.7084 2.1740 1.7357 1.5340 1.6835 1.0140 0.6978 1.9093 0.0098 12.2797 3.4672 0.7238 10.6801 9.1713 0.6628 5.2081 8.1129 1.2451 0.2888 27.7690 1.1855 24.8542 9.1285 1.3536 0.6855 25.9743 0.1159 137.7572 14.1511 2.2027 7.3377 37.6409 2.8759 0.6804 15.5365 1.5701 1.4986 0.3530 0.0485 18.3091 35.0153 10.7332 0.0805 0.0112 0.0729 7.8543 10.8948 8.3255 4.1937 1.2657 1.0738 0.7715 4.6217 2.4811 25.7637 1.6422 69.6816 35.5771 13.9059 23.9916 35.2973 10.1685 52.5078 47.6206 43.9430 1.3172 5.7405 89.5705 35.1119 6.4830 63.4071 20.1202 89.0766 171.6154 31.5629 186.2085 6.2534 19.5837 24.7354 34.4387 0.8544 61.5487 8.7944 14.8603 25.9044 2.2996 5.7966 9.1736 15.8313 5.0332 38.0813 9.9835 19.4022 35.0747 37.3177 4.8487 20.8832
temp: 298.150 k
press: 1.00000 atm
elementType: 8 7 6 6 6 6 6 6 6 6 6 6 6 6 6 6 6 6 6 6 6 6 1 1 1 1 1 1 1 1 1 1 1 1 1 1 1
symmnumber: 1
zpe: 764450.8 jmol-1
zpe.correction: 0.291164 hartree
zpe.thermalcorrener: 0.307672 hartree
zpe.thermalcorrenthalpy: 0.308616 hartree
zpe.thermalcorrgfe: 0.246653 hartree
zpe.sumelectzpe: -899.676034 hartree
zpe.sumelectthermal: -899.659526 hartree
zpe.sumelectthermalent: -899.658582 hartree
zpe.sumelectthermalfe: -899.720545 hartree
dipole: -3.1696 -1.8898 0.0006
dipole: 3.6902
quadrupole: -94.2228 -120.0880 -135.7880
quadrupole: -4.9534 -0.0010 0.0018
quadrupole: 22.4768 -3.3884 -19.0883 -4.9534 -0.0010 0.0018
hfenergy: -899.9671983 hartree
pointgroup: C01 [X(C20H15N1O1)]
dipole: 1.3221038 -0.5999321 0.000051 debye
polarizability: 391.5855247|-18.6305629|288.5681317|0.0338776|-0.0515629|90.0114994 unknown
InChI: InChI=1S/C20H15NO/c1-13(22)21-20-12-19-15-7-3-2-6-14(15)10-11-17(19)16-8-4-5-9-18(16)20/h2-12,21H,1H3
charge 0 multiplicity 1
37 atoms
O  1.026124 3.79868 -0.000796
N  2.45461 1.924964 -0.000454
C  -0.76348 -0.058421 -0.000158
C  -0.271342 -1.403398 0.000216
C  1.172499 -1.634304 0.000434
C  -2.205679 0.194208 -0.00035
C  2.090933 -0.517615 0.000256
C  1.542154 0.833157 -0.00019
C  0.164639 1.035438 -0.000367
C  -3.115809 -0.926572 -0.000183
C  -1.217036 -2.491231 0.000368
C  -2.583299 -2.263873 0.000174
C  1.723384 -2.956011 0.000837
C  3.498995 -0.780264 0.000529
C  -2.767122 1.511294 -0.000697
C  -4.528204 -0.700068 -0.000373
C  3.103003 -3.185487 0.00107
C  4.003456 -2.084586 0.000926
C  -4.153473 1.710957 -0.000877
C  -5.045931 0.598635 -0.000717
C  2.189496 3.299574 -0.000741
C  3.454168 4.161755 -0.000993
H  -0.188905 2.064965 -0.000686
H  -0.860286 -3.524373 0.000638
H  -3.283759 -3.107402 0.000293
H  1.054475 -3.820432 0.000977
H  4.230275 0.037096 0.000477
H  -2.113803 2.388225 -0.000825
H  -5.20046 -1.5665 -0.000243
H  3.444994 1.679744 -0.000469
H  3.489655 -4.210079 0.001376
H  5.085023 -2.256373 0.001135
H  -4.554894 2.730271 -0.001142
H  -6.128642 0.76527 -0.000861
H  4.072912 3.967959 0.894992
H  3.155499 5.219508 -0.001124
H  4.072728 3.967694 -0.89705
