program: Gaussian 09
title: 000269036
version: EM64L-G09RevD.01
frameworkgroup: C1[X(C15H10O2)]
method: RPBEPBE
basis: SDD
operation: Freq
keyword: #pfreq=noraman
keyword: PBEPBE/SDD
title: #p freq=noraman PBEPBE/SDD
converged: NO YES NO YES
title: Mulliken charges:
elementType: O O C C C C C C C C C C C C C C C H H H H H H H H H H
charge: -0.149926 -0.221705 0.295283 0.277929 0.191519 0.230628 -0.315119 -0.527662 -0.399782 0.344132 -0.391600 -0.414419 -0.367392 -0.217760 -0.229016 0.101463 -0.788183 0.290252 0.251283 0.250079 0.281769 0.284199 0.234732 0.239101 0.243256 0.243259 0.263680
chargesum: 0.00000
title: Mulliken charges with hydrogens summed into heavy atoms:
elementType: O O C C C C C C C C C C C C C C C
charge: -0.149926 -0.221705 0.295283 0.277929 0.191519 0.230628 -0.315119 -0.237410 -0.148500 0.344132 -0.141521 -0.132651 -0.083192 0.016972 0.010084 0.101463 -0.037988
polarizability: 3.01391617e+02 3.59189309e-02 1.77815870e+02 7.11463101e-03 8.31668117e-03 6.70006098e+01
1716.lowfreq: -0.0004 0.0002 0.0007 2.1844 7.6606 10.8753 50.6346 59.7680 124.5236
frequency: 50.6101 59.7583 124.5231 131.3011 150.4289 164.3364 167.6693 217.1456 269.0253 303.7779 304.0702 402.0561 413.1414 438.1051 445.7794 488.5350 520.8176 539.7054 571.5733 582.7836 615.9153 640.7988 683.4333 695.3404 722.0277 757.6128 789.9698 804.2270 837.4589 873.1407 904.9991 936.7195 945.9431 949.2308 972.7041 995.4500 1000.8095 1002.1794 1026.3095 1029.5545 1063.5803 1082.6337 1109.4628 1150.9544 1170.7479 1188.4913 1226.3403 1264.8375 1289.0362 1294.8448 1364.6251 1371.1209 1389.7890 1442.7458 1446.2651 1450.8202 1455.1891 1461.0203 1485.4725 1571.8883 1593.5000 1601.3451 1607.9834 1621.5266 1638.7147 2985.9636 3069.7850 3128.2340 3131.9207 3139.1061 3144.0463 3154.1722 3155.1710 3160.4122 3169.2547
redmass: 3.8881 7.6402 5.4078 4.3904 3.3284 1.4971 2.6954 4.5117 8.9095 5.1679 7.4790 3.2033 3.5791 3.1441 4.2505 7.1177 5.9383 3.2129 6.7433 4.8765 2.9155 6.7992 6.1263 3.6861 6.0793 1.4351 2.9713 6.7146 2.9599 1.4080 1.5421 5.8132 1.5702 2.1082 1.4893 5.8490 1.3685 1.3974 2.1184 1.8217 2.0520 2.3429 2.1172 1.7064 1.1886 2.0925 2.0449 2.5921 1.7080 1.8544 2.8674 1.7774 3.3089 3.1625 1.4166 1.7056 3.3301 1.0491 4.0291 7.5225 7.6651 7.0726 8.2132 7.6104 10.4091 1.0376 1.0967 1.0994 1.0864 1.0889 1.0901 1.0947 1.0920 1.0959 1.1003
irintensity: 6.3076 1.9622 3.4099 2.2801 0.6609 1.0545 0.1952 5.2965 0.2975 0.0106 2.9801 1.1279 1.4541 0.0051 7.1386 3.7446 2.6140 0.9822 11.9715 15.9039 9.1099 4.7692 0.3121 0.2851 0.1395 87.5529 18.3292 4.6040 0.7360 31.2480 0.3876 5.8161 11.0712 53.9331 6.9950 4.4169 0.0354 0.5229 0.4736 0.5425 3.8487 3.8477 68.0172 10.8804 17.8831 79.7130 12.8082 216.6064 59.1165 5.9475 14.7899 52.5845 36.6279 1.2578 54.1913 0.2791 3.7737 21.1588 5.4278 130.3968 216.5811 0.1479 68.5976 70.5992 109.7322 2.6980 10.6090 19.8268 1.9278 2.9545 4.9087 9.4043 6.7825 5.3922 31.1224
temp: 298.150 k
press: 1.00000 atm
elementType: 8 8 6 6 6 6 6 6 6 6 6 6 6 6 6 6 6 1 1 1 1 1 1 1 1 1 1
symmnumber: 1
zpe: 532996.0 jmol-1
zpe.correction: 0.203007 hartree
zpe.thermalcorrener: 0.216364 hartree
zpe.thermalcorrenthalpy: 0.217308 hartree
zpe.thermalcorrgfe: 0.162721 hartree
zpe.sumelectzpe: -726.912404 hartree
zpe.sumelectthermal: -726.899048 hartree
zpe.sumelectthermalent: -726.898103 hartree
zpe.sumelectthermalfe: -726.952691 hartree
dipole: 3.4374 -1.5513 0.0004
dipole: 3.7712
quadrupole: -93.5383 -97.9442 -100.6087
quadrupole: -15.8582 -0.0022 -0.0007
quadrupole: 3.8254 -0.5805 -3.2449 -15.8582 -0.0022 -0.0007
hfenergy: -727.1154114 hartree
pointgroup: C01 [X(C15H10O2)]
dipole: 1.3445579 0.627328 -0.0001392 debye
polarizability: 301.3728465|1.5233172|177.8346408|-0.007219|0.0082262|67.0006098 unknown
InChI: InChI=1S/C15H10O2/c1-9(16)10-6-7-12-11-4-2-3-5-13(11)15(17)14(12)8-10/h2-8H,1H3
charge 0 multiplicity 1
27 atoms
O  0.842662 -2.830642 -0.000206
O  -4.80523 1.045565 0.00026
C  0.254338 0.729638 0.000085
C  1.739493 0.665718 0.000016
C  -0.256087 -0.603826 0.000017
C  2.133374 -0.706844 -0.000093
C  0.900028 -1.57042 0.000016
C  -1.629804 -0.870383 0.0000
C  -0.637012 1.820017 0.000163
C  -2.538551 0.227434 0.00009
C  2.713751 1.6794 0.000004
C  3.48397 -1.085373 -0.000222
C  -2.026363 1.556724 0.000176
C  4.083524 1.301302 -0.000115
C  4.467754 -0.062148 -0.000227
C  -4.033118 0.041543 0.00014
C  -4.594985 -1.375434 -0.000507
H  -1.979528 -1.907794 -0.000036
H  -0.274047 2.853262 0.000197
H  2.436387 2.739098 0.000063
H  3.761993 -2.144396 -0.00029
H  -2.755297 2.374394 0.000256
H  4.856159 2.078105 -0.00013
H  5.530789 -0.325311 -0.00031
H  -4.255835 -1.936323 0.890436
H  -4.254732 -1.936113 -0.891146
H  -5.694033 -1.327396 -0.001138
