program: Gaussian 09
title: 000269069
version: EM64L-G09RevD.01
frameworkgroup: C1[X(C15H14N2O5)]
method: RPBEPBE
basis: SDD
operation: Freq
keyword: #p
keyword: freq=noraman
keyword: PBEPBE/SDD
title: #p freq=noraman PBEPBE/SDD
converged: YES YES NO NO
title: Mulliken charges:
elementType: O O O O O N N C C C C C C C C C C C C C C C H H H H H H H H H H H H H H
charge: -0.324628 -0.263235 -0.265083 -0.201496 -0.209052 -0.477703 0.020246 0.360730 0.134172 0.302034 -0.464962 0.134324 0.358968 -0.308781 -0.386674 -0.469180 -0.350828 0.365113 -0.187144 -0.364298 -0.524685 -0.536203 0.367190 0.331447 0.238834 0.241824 0.271155 0.288537 0.245288 0.290419 0.226337 0.248958 0.225338 0.218172 0.218107 0.246761
chargesum: 0.00000
title: Mulliken charges with hydrogens summed into heavy atoms:
elementType: O O O O O N N C C C C C C C C C C C C C C C
charge: -0.324628 -0.263235 -0.265083 -0.201496 -0.209052 -0.110514 0.020246 0.360730 0.134172 0.302034 -0.133515 0.134324 0.358968 -0.069947 -0.144850 -0.198026 -0.062291 0.365113 0.058144 -0.073879 0.175947 0.146837
polarizability: 3.41134376e+02 -1.99013800e+00 2.33048948e+02 5.46039266e+00 -5.24147148e+00 8.74604578e+01
1716.lowfreq: -1.5930 -0.0004 0.0004 0.0006 2.1146 3.0706 12.0138 33.8214 44.7654
frequency: 11.7139 33.8110 44.7324 60.0337 71.2434 89.5013 90.7340 116.8407 139.3046 161.2529 162.8078 185.7815 226.3973 229.5964 241.4691 255.0960 270.4742 309.4428 325.1367 353.8394 368.3802 379.7818 416.6465 430.3898 452.3970 476.7181 512.4014 533.4781 547.0763 590.0766 611.5429 646.4140 657.7600 681.4040 691.2069 694.5537 721.2313 738.4497 753.8277 756.9907 784.0164 810.9573 833.5710 891.9173 896.7601 915.6917 922.9134 932.0545 970.7053 988.3962 993.1815 1015.9497 1016.1775 1071.1461 1090.4444 1102.2535 1113.1996 1119.0828 1134.6824 1148.5481 1158.0815 1171.8083 1184.5034 1200.7299 1214.4260 1254.6872 1261.5713 1284.3522 1297.3166 1371.6713 1393.7576 1395.4522 1427.0394 1429.9829 1438.6656 1454.7188 1464.5540 1466.9525 1467.0922 1474.4056 1475.9777 1489.4066 1524.8191 1569.2158 1600.1253 1607.3961 1613.7044 1627.7475 2954.6512 2966.3764 3040.3823 3056.4057 3124.6107 3129.6257 3152.5916 3154.7353 3155.7037 3169.8620 3175.5429 3188.3220 3204.5068 3497.4791
redmass: 6.3132 6.3019 6.7313 8.4321 4.1805 4.3344 3.4572 7.3655 4.9316 4.7386 3.9915 4.7781 4.8729 1.1159 4.8860 1.1980 4.3526 3.9042 8.3150 9.0708 6.3214 5.2021 3.2783 7.4955 3.4126 5.0533 5.7746 6.0072 4.5019 6.2739 3.4389 7.2450 5.5015 5.4791 2.2598 9.1799 1.9603 5.0718 2.3635 4.7548 1.4716 8.2940 1.4578 1.3849 6.5845 4.5833 1.4142 1.6992 1.3771 6.0655 6.6221 2.0898 1.9005 2.2337 1.7842 2.3885 1.2601 1.2553 1.6862 1.7893 1.3664 1.1361 2.2716 1.9302 8.2416 1.6453 4.7770 1.7900 1.4856 10.3091 6.8995 6.6942 1.6051 2.6746 1.2181 2.3454 2.0506 1.0505 1.0501 1.2679 1.2076 2.0612 2.2586 6.8873 8.0428 4.5308 6.7991 7.2663 1.0333 1.0325 1.1037 1.1044 1.0989 1.1002 1.0881 1.0871 1.0918 1.0943 1.0953 1.0970 1.0929 1.0757
irintensity: 2.2452 4.3253 1.3971 4.0311 0.6375 2.4979 1.4872 4.5196 9.9074 3.2803 0.7112 0.5038 1.2060 0.1114 3.1451 0.9796 1.1597 7.4968 11.0954 0.0497 1.0863 0.6750 0.3457 1.6737 6.6351 5.3457 3.1608 0.1390 9.1271 14.4748 0.6912 5.4975 2.3970 29.3495 23.6889 26.0331 47.7814 1.2879 53.1779 16.5616 59.1545 9.3780 23.3424 0.7584 13.9200 4.3450 32.1489 28.1477 1.3399 1.5892 57.1194 63.4308 39.0364 5.1647 38.3849 40.8064 0.2062 0.1252 18.8562 14.6116 1.7550 34.4705 137.6192 41.8958 370.9495 96.7815 84.6375 3.8126 3.8987 104.6758 3.1461 4.8993 64.2056 34.8826 1.7721 74.0994 111.5346 14.3823 13.3876 101.2580 14.3066 63.5269 535.2612 62.2280 128.1124 15.0326 0.7324 35.0343 78.6122 69.7267 52.5759 43.2016 25.1451 14.2523 6.3663 9.4169 3.7120 7.9931 11.3135 2.8189 10.5292 47.6308
temp: 298.150 k
press: 1.00000 atm
elementType: 8 8 8 8 8 7 7 6 6 6 6 6 6 6 6 6 6 6 6 6 6 6 1 1 1 1 1 1 1 1 1 1 1 1 1 1
symmnumber: 1
zpe: 706290.4 jmol-1
zpe.correction: 0.269012 hartree
zpe.thermalcorrener: 0.289174 hartree
zpe.thermalcorrenthalpy: 0.290119 hartree
zpe.thermalcorrgfe: 0.217988 hartree
zpe.sumelectzpe: -1063.945672 hartree
zpe.sumelectthermal: -1063.925509 hartree
zpe.sumelectthermalent: -1063.924565 hartree
zpe.sumelectthermalfe: -1063.996695 hartree
dipole: -4.0317 1.7025 1.0774
dipole: 4.5071
quadrupole: -114.6275 -120.5769 -130.4273
quadrupole: -29.1299 4.4326 1.0275
quadrupole: 7.2497 1.3004 -8.5501 -29.1299 4.4326 1.0275
hfenergy: -1064.2146834 hartree
pointgroup: C01 [X(C15H14N2O5)]
dipole: -1.7179832 0.4316732 -0.0809276 debye
polarizability: 333.9645146|35.81269|164.5171019|11.3250724|-72.1617192|163.1621653 unknown
InChI: InChI=1S/C15H14N2O5/c1-21-12-6-7-14(22-2)13(9-12)16-15(18)10-4-3-5-11(8-10)17(19)20/h3-9,16H,1-2H3
charge 0 multiplicity 1
36 atoms
O  -1.637977 1.916253 -1.295826
O  -4.678879 -2.027647 1.311083
O  0.073715 -1.490788 1.810794
O  5.571926 2.133998 -1.161815
O  3.474658 2.343673 -2.031427
N  -0.463621 0.209107 0.287607
N  4.307548 1.877022 -1.160752
C  -1.865858 0.044854 0.165641
C  -2.515828 0.979097 -0.70603
C  1.880066 -0.136669 0.93249
C  -2.624907 -0.942636 0.821421
C  0.42368 -0.536036 1.047677
C  -4.025467 -1.001721 0.60708
C  -3.9016 0.911377 -0.909864
C  -4.66971 -0.08316 -0.25234
C  2.395677 0.704817 -0.081441
C  2.768361 -0.678068 1.899542
C  3.776052 0.993136 -0.090568
C  4.145388 -0.374136 1.870572
C  4.668434 0.47217 0.87073
C  -2.210488 2.905801 -2.20864
C  -6.126235 -2.146452 1.134954
H  -0.112234 1.002046 -0.258446
H  -2.142052 -1.655821 1.490443
H  -4.403612 1.61987 -1.575044
H  -5.748913 -0.1212 -0.422305
H  1.785064 1.12985 -0.884358
H  2.344449 -1.34369 2.658311
H  4.813329 -0.79793 2.62681
H  5.729845 0.72731 0.817027
H  -2.68315 2.413472 -3.080069
H  -1.362216 3.520568 -2.54299
H  -2.952818 3.540749 -1.688093
H  -6.389469 -2.350176 0.078084
H  -6.651662 -1.233185 1.477978
H  -6.422595 -3.000658 1.761161
