program: Gaussian 09
title: 000269037
version: EM64L-G09RevD.01
frameworkgroup: C1[X(C13H8N2O3)]
method: RPBEPBE
basis: SDD
operation: Freq
keyword: #p
keyword: freq=noraman
keyword: PBEPBE/SDD
title: #p freq=noraman PBEPBE/SDD
converged: YES YES NO YES
title: Mulliken charges:
elementType: O O O N N C C C C C C C C C C C C C H H H H H H H H
charge: -0.401249 -0.194420 -0.165752 -0.001670 0.004387 0.227124 0.043008 0.219474 0.282635 -0.229016 0.303848 -0.422990 -0.393290 -0.404121 -0.365207 -0.212360 -0.229156 -0.233212 0.255915 0.248287 0.301395 0.268432 0.241588 0.233223 0.235452 0.387674
chargesum: 0.00000
title: Mulliken charges with hydrogens summed into heavy atoms:
elementType: O O O N N C C C C C C C C C C C C C
charge: -0.013575 -0.194420 -0.165752 -0.001670 0.004387 0.227124 0.043008 0.219474 0.282635 -0.229016 0.303848 -0.167076 -0.145003 -0.102726 -0.096774 0.029228 0.004066 0.002240
polarizability: 2.51803026e+02 5.75224985e+00 2.13817680e+02 6.76633242e+00 1.07860602e+00 7.10091932e+01
1716.lowfreq: -7.0305 -4.9559 -0.0010 -0.0004 0.0002 1.6938 43.8400 57.1052 109.6335
frequency: 43.8355 57.1045 109.6334 120.2324 137.8191 164.8187 190.3276 227.5083 239.5180 301.8312 324.2597 369.1609 387.3707 407.8660 429.5252 456.8507 515.8596 527.3521 535.2708 556.5119 616.9276 626.9017 649.2865 670.8872 694.9461 721.4994 747.6991 756.1542 777.0797 801.4698 827.1288 846.1592 892.1429 900.4034 922.8776 952.6413 967.5656 982.4093 998.3768 1018.7699 1042.3040 1074.5113 1094.1312 1147.0496 1157.2139 1173.9071 1196.6758 1222.8059 1236.1349 1282.4239 1302.5982 1320.1358 1377.2002 1382.1612 1395.8022 1432.1566 1447.1514 1465.4837 1476.0995 1579.4954 1582.3679 1593.5853 1615.6535 1622.4104 3130.6740 3142.4008 3144.4207 3161.2818 3162.9625 3181.7259 3201.2094 3553.8381
redmass: 9.2830 11.1346 4.3070 5.2419 9.8133 5.5769 6.1536 6.8618 5.8283 6.0206 8.3701 7.4724 4.7457 4.2569 4.5330 3.1352 1.4834 5.6317 4.7517 4.6137 5.3794 7.3993 3.9910 7.5766 5.7298 7.5969 1.7256 6.8694 1.6290 2.9767 2.4186 7.5232 8.9628 1.4700 1.4877 8.1219 1.4273 1.3718 1.3452 2.7927 3.7546 1.9854 2.4860 2.0909 1.6810 1.1166 1.6822 2.1873 7.0227 2.2219 1.7389 1.5285 4.6961 9.1153 4.3386 2.4195 3.1284 2.9411 4.4159 7.2125 7.1567 7.0767 7.6214 7.9044 1.0864 1.0888 1.0908 1.0937 1.0978 1.0974 1.0952 1.0674
irintensity: 0.9147 1.0534 1.8983 3.8972 1.4334 0.7836 0.1541 1.2090 1.9719 0.4230 0.9651 5.7567 10.5739 8.4597 1.4526 9.2950 94.1545 3.4192 1.8719 0.6077 1.7164 7.0619 20.9468 20.8994 29.4869 9.0719 6.3770 17.7367 109.1427 22.4791 7.1312 3.2700 151.4333 0.4575 2.2494 46.7708 5.4599 1.7874 0.3776 4.2690 1.1210 1.9943 8.4125 35.2085 5.2485 1.8953 0.7645 17.1232 144.8605 22.6392 6.7949 76.9348 46.3862 80.5139 22.9753 35.3445 13.7107 2.9599 2.6787 2.2916 0.8769 1.0907 13.3926 18.1655 1.4934 7.5106 8.3159 12.2247 29.8056 4.6343 4.6890 108.0388
temp: 298.150 k
press: 1.00000 atm
elementType: 8 8 8 7 7 6 6 6 6 6 6 6 6 6 6 6 6 6 1 1 1 1 1 1 1 1
symmnumber: 1
zpe: 480731.0 jmol-1
zpe.correction: 0.183101 hartree
zpe.thermalcorrener: 0.196914 hartree
zpe.thermalcorrenthalpy: 0.197858 hartree
zpe.thermalcorrgfe: 0.142132 hartree
zpe.sumelectzpe: -834.004022 hartree
zpe.sumelectthermal: -833.990209 hartree
zpe.sumelectthermalent: -833.989265 hartree
zpe.sumelectthermalfe: -834.044991 hartree
dipole: 4.2438 -2.6968 -0.2239
dipole: 5.0332
quadrupole: -103.0445 -80.4787 -108.7796
quadrupole: 8.6366 -0.9003 -2.5614
quadrupole: -5.6102 16.9555 -11.3453 8.6366 -0.9003 -2.5614
hfenergy: -834.1871231 hartree
pointgroup: C01 [X(C13H8N2O3)]
dipole: -1.6371221 -1.1091298 0.1042006 debye
dipolederiv: -0.2322747 1.0421123 0.0778247 0.2437633 -1.1592723 -0.0639866 -0.0010454 -0.0769587 -0.3442798 -0.7656735 -0.0886843 -0.2828771 -0.2107967 -0.3317895 0.0517567 -0.2009831 0.0913869 -0.4764449 -0.4416497 -0.1430285 -0.0580037 -0.1295301 -0.4613905 0.2808345 -0.1404396 0.1767248 -0.5097043 -0.1230732 -0.8230983 -0.0790456 -0.1502005 0.8648039 0.0842889 0.0095293 0.0495124 -0.1040956 1.0607925 0.3387788 0.3918921 0.5702804 0.7246085 -0.3910029 0.3799638 -0.2555161 0.8057078 0.3624142 -0.3490579 -0.0109075 0.0039892 -0.1120414 0.0064851 -0.0031081 -0.0027136 0.0117309 -0.2456374 0.0088996 -0.0286498 -0.2362404 0.2348831 0.0318779 0.0863246 0.1049091 0.0127787 0.1431744 0.1973209 0.0072492 -0.0596171 -0.0740733 -0.0050872 0.010152 -0.0121517 -0.0007231 -0.2654161 0.1215084 0.0085753 0.1324503 -0.052961 -0.0050628 0.0176783 -0.0021024 0.0699911 0.4852441 -0.0861258 0.0003839 -0.0177838 -0.2148734 -0.0112644 -0.0398566 -0.0427124 0.0198008 0.1246677 -0.0768385 -0.0379995 -0.1926291 -0.0537897 0.0433076 -0.0529899 -0.0074947 -0.0003756 -0.0842665 0.1427656 0.0151567 0.1222387 0.0406554 -0.0051137 0.0005388 0.0020276 -0.1449338 -0.2179654 -0.1432197 -0.0116788 0.059425 0.1168142 0.0023292 -0.0030677 0.0036414 -0.1550629 -0.0090934 -0.0215437 -0.0050955 -0.094086 0.0852273 -0.0003146 -0.0066055 0.0061432 -0.1336945 -0.1433456 -0.0383583 0.010594 0.1852247 -0.0363691 0.0139512 -0.0690074 -0.0598737 -0.1134022 -0.0705741 -0.0811993 -0.0037396 -0.1602583 0.0872906 -0.0173437 0.0047924 -0.0117205 -0.13167 0.123472 0.1201298 0.0044918 0.0908013 -0.0915995 -0.0056886 0.0041413 0.0043204 -0.1385274 0.0325516 -0.0369189 0.0047067 -0.0931014 0.0142479 0.0037282 -0.0001894 0.0026724 -0.1686708 0.0311545 -0.1122921 0.000806 -0.0690396 -0.00469 0.0001841 -0.0006312 0.0026029 0.1546881 0.0976779 0.0418098 -0.0007051 -0.0077057 -0.0930916 -0.0036555 -0.0008546 -0.0034482 0.155539 0.113397 -0.0245543 -0.0005988 0.0330797 -0.0043928 -0.0015977 0.0019814 -0.0032927 0.1706848 -0.0023174 0.015398 0.0061399 -0.0101019 0.1048575 -0.0065635 0.0046832 0.0202742 0.1600686 0.04135 0.0708795 -0.0020715 0.0740834 -0.0679906 0.0063965 0.0067789 0.0057924 0.1581733 -0.0838212 -0.0863234 -0.0022488 -0.1026529 0.0352859 -0.0021068 -0.0032276 -0.0025693 0.1588424 -0.0924205 0.0704071 -0.0014137 0.0879904 0.0505153 -0.000814 0.0003941 -0.0014974 0.1618847 0.1616325 -0.0587668 -0.0027855 -0.0695831 0.399135 -0.0055379 -0.0049522 0.0120438 0.3816948 unknown
polarizability: 252.1885128|-4.6036548|213.5004585|5.6472063|-1.5594034|70.9409276 unknown
InChI: InChI=1S/C13H8N2O3/c16-14-13-10-5-2-1-4-8(10)9-6-3-7-11(12(9)13)15(17)18/h1-7,16H
charge 0 multiplicity 1
26 atoms
O  -0.758789 3.276431 0.214542
O  4.04646 0.832225 0.655922
O  2.83478 1.714007 -1.06544
N  0.287166 2.277166 0.135772
N  3.035091 0.836155 -0.149376
C  -0.141411 -1.306042 -0.020728
C  0.683046 -0.131403 -0.033961
C  -1.55631 -0.883379 -0.019866
C  -1.608698 0.547414 -0.004039
C  -0.215887 1.057649 0.017821
C  2.081799 -0.299699 -0.040176
C  0.42198 -2.595742 0.00156
C  -2.738091 -1.645915 -0.031053
C  -2.848256 1.221187 0.003193
C  2.660733 -1.590008 0.017556
C  1.83058 -2.731097 0.03109
C  -3.982526 -0.968117 -0.028592
C  -4.03532 0.447367 -0.01236
H  -0.21689 -3.484665 0.007018
H  -2.706998 -2.740806 -0.041805
H  -2.885624 2.311223 0.018623
H  3.750039 -1.683049 0.040842
H  2.286224 -3.725756 0.060796
H  -4.914339 -1.544041 -0.038836
H  -5.007988 0.9510 -0.010783
H  -0.240172 4.11919 0.288985
