program: Gaussian 09
title: 000269029
version: EM64L-G09RevD.01
frameworkgroup: C1[X(C10H13ClN2O)]
method: RPBEPBE
basis: SDD
operation: Freq
keyword: #p
keyword: freq=noraman
keyword: PBEPBE/SDD
title: #p freq=noraman PBEPBE/SDD
converged: YES YES NO NO
title: Mulliken charges:
elementType: Cl O N N C C C C C C C C C C H H H H H H H H H H H H H
charge: -0.070441 -0.294928 -0.419180 -0.494675 -0.360139 -0.339754 -0.689092 0.490939 0.294286 -0.438783 -0.325840 -0.187624 -0.199682 -0.119020 0.260854 0.207653 0.203753 0.228445 0.285765 0.206679 0.230124 0.205201 0.287097 0.219491 0.313816 0.252447 0.252608
chargesum: 0.00000
title: Mulliken charges with hydrogens summed into heavy atoms:
elementType: Cl O N N C C C C C C C C C C
charge: -0.070441 -0.294928 -0.133415 -0.207578 0.108368 0.092444 -0.047087 0.490939 0.294286 -0.219292 -0.012024 0.064823 0.052926 -0.119020
polarizability: 2.28687598e+02 -1.87313060e+00 1.24152684e+02 1.05805064e+01 -5.72356739e+00 7.27883543e+01
1716.lowfreq: -0.0020 -0.0018 -0.0009 1.6767 4.4558 8.4660 12.9379 38.9504 51.1554
frequency: 12.6469 38.8095 51.1485 71.2157 90.6055 120.2766 139.1805 216.8930 229.2270 245.5282 276.5362 305.5237 340.2008 364.5171 378.3145 411.7270 430.7129 492.1072 506.7275 576.7279 620.3089 653.5298 698.9199 700.5154 705.0555 763.6548 808.2915 826.9012 844.9088 869.6064 879.9459 930.9616 960.8722 979.8091 991.1985 1021.6922 1073.6503 1092.6847 1113.6163 1123.9485 1133.4253 1183.1267 1211.6388 1250.6592 1266.8728 1282.5547 1294.1406 1341.3796 1356.7025 1366.5209 1388.2403 1401.3980 1450.4374 1462.5337 1476.1801 1478.1022 1484.0336 1492.2203 1506.0541 1593.5810 1609.0521 1645.8916 2971.3141 2987.7719 2990.9156 3040.8314 3069.0165 3075.1491 3080.7536 3115.6806 3163.7332 3170.1666 3195.0919 3527.2784 3554.8002
redmass: 3.7224 5.3146 4.4519 3.7522 3.0479 3.2455 4.3648 1.5137 3.3701 3.1395 4.5471 2.7630 3.0744 2.1196 2.8533 3.0282 4.5592 2.7905 2.6369 1.2326 6.7946 6.0945 4.0928 3.2828 6.9462 1.5526 1.4157 4.1850 1.4009 2.2922 1.8251 1.3537 2.4412 1.3092 4.3399 2.0842 2.5671 2.4249 1.3663 2.9060 1.8622 1.1116 1.8728 1.2239 1.8941 1.3519 1.3960 1.3970 1.8650 2.0631 1.2358 4.6006 1.1297 1.0780 1.8131 1.0556 1.3602 1.4562 2.3687 6.1815 6.1174 4.3094 1.0361 1.0618 1.0660 1.0984 1.1002 1.0982 1.0993 1.0900 1.0912 1.0951 1.0952 1.0761 1.0772
irintensity: 0.9247 1.0969 5.7128 3.8794 3.6091 2.4334 0.6788 0.7825 0.9829 1.2798 4.0770 7.1281 16.8052 19.1236 13.9027 0.0515 12.7066 3.5921 67.5219 143.3629 3.5369 14.9271 8.1693 0.7523 4.8522 29.5873 42.8320 1.8162 58.3356 11.1285 3.0354 0.8553 5.8317 3.2905 27.4154 2.9806 38.6214 4.2437 17.7227 0.1542 1.3598 8.8290 284.8544 23.7062 60.6476 66.4925 29.2190 10.0873 57.0715 74.6686 25.1106 8.8297 35.7081 10.3802 230.2190 26.5046 10.1942 12.5508 826.7427 26.9782 27.9778 157.3883 33.2272 29.2433 52.1298 3.4031 89.7936 40.8155 17.5900 18.8248 3.3306 3.2094 10.2678 5.0395 20.8584
temp: 298.150 k
press: 1.00000 atm
elementType: 17 8 7 7 6 6 6 6 6 6 6 6 6 6 1 1 1 1 1 1 1 1 1 1 1 1 1
symmnumber: 1
zpe: 565689.8 jmol-1
zpe.correction: 0.215460 hartree
zpe.thermalcorrener: 0.229996 hartree
zpe.thermalcorrenthalpy: 0.230940 hartree
zpe.thermalcorrgfe: 0.171273 hartree
zpe.sumelectzpe: -1032.628336 hartree
zpe.sumelectthermal: -1032.613799 hartree
zpe.sumelectthermalent: -1032.612855 hartree
zpe.sumelectthermalfe: -1032.672522 hartree
dipole: -4.5592 4.1457 -0.6884
dipole: 6.2006
quadrupole: -89.7579 -84.0883 -93.5073
quadrupole: -4.5475 0.8849 -3.3441
quadrupole: -0.6400 5.0295 -4.3895 -4.5475 0.8849 -3.3441
hfenergy: -1032.8437954 hartree
pointgroup: C01 [X(C10H13Cl1N2O1)]
dipole: -1.7465238 -1.6858074 0.2426533 debye
polarizability: 228.4503063|4.9997327|124.5527058|-10.6841362|-5.0390691|72.6256241 unknown
InChI: InChI=1S/C10H13ClN2O/c1-2-7-12-10(14)13-9-5-3-8(11)4-6-9/h3-6,12-13H,2,7H2,1H3
charge 0 multiplicity 1
27 atoms
Cl 5.564482 0.397776 -0.412685
O  -1.332148 1.491085 0.287343
N  -2.670992 -0.397127 0.609514
N  -0.352024 -0.660227 0.393533
C  -3.924062 0.376045 0.643402
C  -4.691822 0.378898 -0.700702
C  -5.15085 -1.023784 -1.154097
C  1.020574 -0.352062 0.201895
C  -1.442185 0.23438 0.416603
C  1.942654 -1.435312 0.222214
C  1.503902 0.968973 -0.007354
C  3.322216 -1.214744 0.036776
C  2.885334 1.188796 -0.194167
C  3.777587 0.101078 -0.170819
H  -3.648418 1.408835 0.916715
H  -4.56832 -0.033972 1.445926
H  -5.573977 1.039457 -0.584708
H  -4.048334 0.83836 -1.47444
H  -2.733586 -1.415077 0.643802
H  -5.798506 -1.49975 -0.392571
H  -5.726328 -0.968869 -2.095502
H  -4.287107 -1.690789 -1.337522
H  -0.554277 -1.650129 0.547773
H  1.584846 -2.460339 0.383735
H  0.797576 1.800599 -0.018537
H  4.025464 -2.052143 0.054051
H  3.257805 2.204741 -0.355075
