program: Gaussian 09
title: 000269033
version: EM64L-G09RevD.01
frameworkgroup: C1[X(C11H14ClN3O2)]
method: RPBEPBE
basis: SDD
operation: Freq
keyword: #p
keyword: freq=noraman
keyword: PBEPBE/SDD
title: #p freq=noraman PBEPBE/SDD
converged: YES YES NO NO
title: Mulliken charges:
elementType: Cl O O N N N C C C C C C C C C C C H H H H H H H H H H H H H H
charge: -0.040807 -0.252310 -0.234007 -0.484131 -0.190106 0.032991 0.309988 0.278917 0.468324 -0.527194 -0.331767 -0.438485 -0.841763 -0.331986 0.297594 -0.811913 -0.571350 0.234445 0.295865 0.380830 0.234258 0.234859 0.233608 0.244983 0.271246 0.275789 0.231278 0.226902 0.229843 0.277568 0.296531
chargesum: 0.00000
title: Mulliken charges with hydrogens summed into heavy atoms:
elementType: Cl O O N N N C C C C C C C C C C C
charge: -0.040807 -0.252310 -0.234007 -0.103301 -0.190106 0.032991 0.309988 0.278917 0.468324 -0.292749 -0.035902 -0.204228 -0.128313 0.215050 0.297594 -0.123891 0.002748
polarizability: 2.66810425e+02 -1.08605030e+01 1.70795169e+02 1.00507031e+01 7.41766695e+00 8.30200000e+01
1716.lowfreq: -15.0631 -8.2535 0.0018 0.0022 0.0023 4.3647 7.0663 20.7843 25.5314
frequency: -12.7394 20.6298 25.4257 38.8787 59.0825 77.2987 95.3783 124.7116 164.4995 182.1187 194.3518 201.1167 205.8957 245.9747 272.3403 289.9904 337.6160 362.5009 378.4061 437.7279 443.9920 452.6376 480.3111 536.2628 549.8576 562.0396 682.3154 700.8404 711.8918 727.0922 728.8761 783.8309 787.6477 811.8246 843.2032 855.9451 889.2068 916.8949 933.6950 977.4542 978.2694 1016.8320 1040.7664 1042.2386 1048.8560 1053.2252 1083.8536 1136.0879 1173.4629 1209.4397 1227.4974 1242.1405 1267.1997 1288.1886 1296.9690 1323.4675 1357.6167 1370.9223 1376.6426 1398.2017 1400.8750 1415.5847 1436.4173 1455.1616 1463.3601 1470.7135 1476.7003 1480.9777 1502.4897 1528.7002 1598.2282 1627.1075 1660.8439 2960.7221 2975.5689 3031.0644 3046.1665 3052.3580 3069.7780 3085.6949 3089.6963 3116.5543 3120.4090 3134.1653 3159.7743 3190.5111 3445.2521
redmass: 1.0490 4.4812 6.1786 6.5378 2.9276 5.5537 5.8307 6.3358 2.2973 1.8495 8.0187 6.5212 1.8215 6.8309 4.0591 3.2407 3.2137 4.6299 6.6180 4.6058 3.0992 5.8520 6.3544 6.2786 5.1403 2.9515 7.0581 6.7084 5.1467 3.0964 2.3160 1.9834 1.2554 4.4182 1.3309 5.2519 1.2956 2.8059 3.3348 1.5006 1.3337 1.4857 1.5183 2.2015 1.5629 2.4131 4.1673 1.9543 1.5141 1.9531 1.8286 2.8379 1.1755 4.2969 1.3770 1.1997 1.3444 6.8549 4.8339 1.2518 1.2789 3.0508 1.1188 1.0931 1.5346 1.0463 1.1152 1.0441 1.7505 2.0292 4.6964 6.1481 9.0855 1.0398 1.0375 1.0978 1.0591 1.0976 1.0558 1.0984 1.0954 1.0913 1.1049 1.0910 1.1129 1.0942 1.0759
irintensity: 0.3371 0.1558 0.1264 0.0077 1.2870 1.1871 1.4839 10.9594 0.3429 2.5530 3.7198 14.8063 1.8236 1.1512 0.3704 0.8992 7.5094 2.6709 30.0477 0.7192 6.9460 11.7272 4.0101 3.6298 1.8586 9.9461 12.3837 56.7929 4.3282 1.3872 1.3067 113.6865 68.3389 15.9402 55.2711 23.0239 1.3628 84.3731 74.6337 11.0747 3.8201 1.3666 1.9200 63.3560 16.7032 13.5222 28.0621 7.1479 7.2874 2.6249 19.5515 19.4938 4.6344 6.4755 7.6622 23.3454 17.9131 138.7373 61.8271 10.4548 18.2003 1.2697 23.4701 9.9313 149.1335 14.5409 24.5576 13.7901 20.5105 481.3505 39.6245 10.1554 269.5711 23.7827 42.1675 18.3938 1.9997 21.2195 12.8131 17.7492 16.8973 23.7194 1.3055 17.8912 2.6010 2.9779 54.5516
temp: 298.150 k
press: 1.00000 atm
elementType: 17 8 8 7 7 7 6 6 6 6 6 6 6 6 6 6 6 1 1 1 1 1 1 1 1 1 1 1 1 1 1
symmnumber: 1
zpe: 628138.2 jmol-1
zpe.correction: 0.239245 hartree
zpe.thermalcorrener: 0.256251 hartree
zpe.thermalcorrenthalpy: 0.257195 hartree
zpe.thermalcorrgfe: 0.191716 hartree
zpe.sumelectzpe: -1201.034190 hartree
zpe.sumelectthermal: -1201.017184 hartree
zpe.sumelectthermalent: -1201.016240 hartree
zpe.sumelectthermalfe: -1201.081719 hartree
dipole: 4.0738 1.1565 0.4602
dipole: 4.2597
quadrupole: -108.6847 -112.3234 -107.2673
quadrupole: 1.6690 1.6227 -0.0669
quadrupole: 0.7404 -2.8982 2.1578 1.6690 1.6227 -0.0669
hfenergy: -1201.2734347 hartree
pointgroup: C01 [X(C11H14Cl1N3O2)]
dipole: -1.5749851 -0.5533877 0.1475107 debye
polarizability: 268.0072302|-4.7737848|170.1156536|-6.9757087|-6.4141861|82.5027098 unknown
InChI: InChI=1S/C11H14ClN3O2/c1-8-3-4-10(9(2)7-8)13-11(16)15(14-17)6-5-12/h3-4,7,13H,5-6H2,1-2H3
charge 0 multiplicity 1
31 atoms
Cl 5.821967 1.747885 0.474457
O  1.144256 1.62549 -0.408031
O  3.393059 -2.379301 -0.064518
N  -0.000533 -0.433199 -0.114608
N  2.357083 -0.380465 -0.283629
N  2.275455 -1.76372 -0.082961
C  -1.371107 -0.040197 -0.050762
C  -2.33827 -1.079144 0.127008
C  -4.138847 0.629982 0.088577
C  -3.700571 -0.716167 0.191923
C  -1.782184 1.310987 -0.156957
C  -3.154137 1.631133 -0.086828
C  -1.918461 -2.535883 0.241885
C  3.637565 0.33038 -0.497708
C  1.099233 0.372645 -0.276181
C  -5.615615 0.974729 0.167593
C  4.182827 0.890454 0.826631
H  -4.445946 -1.510437 0.327639
H  -1.033668 2.093678 -0.293917
H  0.214696 -1.433828 -0.022367
H  -3.459153 2.680719 -0.171076
H  -1.394046 -2.893789 -0.666629
H  -1.247673 -2.712821 1.10639
H  -2.798825 -3.184159 0.381138
H  4.34756 -0.395944 -0.927773
H  3.453496 1.153375 -1.204897
H  -6.042845 0.696001 1.149653
H  -5.78424 2.055502 0.023634
H  -6.198348 0.437017 -0.603875
H  4.405613 0.100652 1.558262
H  3.521061 1.659925 1.247832
