program: Gaussian 09
title: 000269026
version: EM64L-G09RevD.01
frameworkgroup: C1[X(C7H12N2O3)]
method: RPBEPBE
basis: SDD
operation: Freq
keyword: #p
keyword: freq=noraman
keyword: PBEPBE/SDD
title: #p freq=noraman PBEPBE/SDD
converged: YES YES NO NO
title: Mulliken charges:
elementType: O O O N N C C C C C C C H H H H H H H H H H H H
charge: -0.412857 -0.216799 -0.269212 -0.091060 0.043179 -0.379636 -0.153167 -0.398869 -0.365618 -0.420034 -0.382525 0.152390 0.220234 0.229784 0.286483 0.209469 0.207752 0.203602 0.195656 0.235634 0.212671 0.264595 0.243562 0.384766
chargesum: 0.00000
title: Mulliken charges with hydrogens summed into heavy atoms:
elementType: O O O N N C C C C C C C
charge: -0.028091 -0.216799 -0.269212 -0.091060 0.043179 0.070382 0.133316 0.018352 0.033640 0.028272 0.125632 0.152390
polarizability: 1.15267535e+02 2.29707336e+00 8.84423872e+01 -2.21153957e+00 3.27844495e+00 8.74622864e+01
1716.lowfreq: -23.3810 -11.6257 -0.0006 -0.0005 -0.0003 8.9518 34.6614 51.6905 89.5028
frequency: 32.1484 51.6314 89.4660 132.3014 174.0868 227.4326 249.0690 300.9176 307.4284 352.3728 371.6234 384.9317 409.6075 477.3981 510.6028 558.1988 612.6813 655.6445 719.0577 738.5708 795.0476 810.1874 845.1167 880.1955 886.3788 951.5999 973.4030 1013.3279 1030.5926 1044.2158 1083.4864 1108.8352 1136.7485 1164.3255 1206.6756 1220.2110 1242.1088 1257.0616 1272.9823 1289.4636 1302.8311 1328.9161 1339.9465 1350.4163 1352.6321 1359.8570 1367.3333 1383.4616 1453.4293 1462.5885 1465.0783 1471.6873 1482.1007 1664.0937 2970.6231 2971.5515 2982.6854 2985.0860 2994.7303 3000.3143 3027.4919 3031.4213 3034.8291 3054.8036 3066.8638 3514.5619
redmass: 3.9525 8.9246 4.0307 5.7139 2.5599 4.5802 2.9961 4.9005 3.2448 2.4213 5.0068 3.9883 5.6109 1.6934 2.5236 3.1583 2.0213 2.2463 4.1351 2.7421 2.6561 1.8634 2.5784 2.5635 1.9449 1.9796 1.9867 2.6730 2.8817 3.0097 2.0898 1.9887 1.9372 1.4429 1.2435 1.8745 1.3036 1.4524 1.2152 1.3875 1.7761 2.7608 1.4405 1.5264 1.4916 1.5230 1.4388 2.1496 1.0861 1.0852 1.0894 1.0981 1.0808 9.2056 1.0598 1.0653 1.0593 1.0772 1.0644 1.0674 1.0989 1.0966 1.0999 1.0998 1.1014 1.0642
irintensity: 2.6940 1.6868 0.0037 2.5579 0.2610 3.7858 0.3352 2.1931 0.1602 1.1845 7.7827 2.3930 4.0480 3.3924 7.2059 43.6218 73.0579 75.7051 4.8072 13.1472 2.9121 6.3374 19.5370 61.0199 6.8674 4.9032 9.3867 18.2875 70.3182 339.2501 4.7073 9.9034 3.5051 5.0416 2.7647 3.4814 2.6983 12.3098 9.0467 20.3445 28.2851 52.0662 15.5482 3.0631 2.9777 15.2713 1.9528 46.6458 8.5917 9.8187 13.7901 13.2996 20.4641 190.7196 32.4718 21.8488 3.7275 15.3966 25.5620 12.9245 42.7143 18.1659 58.3451 36.7183 29.8229 30.9768
temp: 298.150 k
press: 1.00000 atm
elementType: 8 8 8 7 7 6 6 6 6 6 6 6 1 1 1 1 1 1 1 1 1 1 1 1
symmnumber: 1
zpe: 508332.0 jmol-1
zpe.correction: 0.193613 hartree
zpe.thermalcorrener: 0.205271 hartree
zpe.thermalcorrenthalpy: 0.206215 hartree
zpe.thermalcorrgfe: 0.155242 hartree
zpe.sumelectzpe: -608.115653 hartree
zpe.sumelectthermal: -608.103995 hartree
zpe.sumelectthermalent: -608.103051 hartree
zpe.sumelectthermalfe: -608.154025 hartree
dipole: 4.8494 2.3594 -0.0961
dipole: 5.3938
quadrupole: -79.5612 -68.0001 -72.7729
quadrupole: -8.3381 -1.7837 0.4700
quadrupole: -6.1165 5.4447 0.6718 -8.3381 -1.7837 0.4700
hfenergy: -608.3092663 hartree
pointgroup: C01 [X(C7H12N2O3)]
dipole: -0.4634678 1.8586312 0.9131602 debye
dipolederiv: -0.6789827 -0.4544033 -0.0095341 -0.4097268 -0.9910603 -0.1085634 -0.0461162 -0.1980479 -0.3074461 -0.4751092 -0.052262 -0.1791354 -0.1524605 -0.7085138 0.1282953 -0.0987957 0.3434265 -0.6761494 -0.2218437 -0.4299234 -0.2572926 0.0757375 -1.0247519 -0.628573 0.0834469 -0.1114631 -0.3428307 -0.238839 0.2136574 0.1729729 0.0386746 -0.7546258 -0.3115705 0.0030808 -0.4716313 -0.5489124 -0.0871985 0.0402077 -0.0167425 -0.1579027 1.0570111 0.897938 -0.1283579 0.7358068 0.5136878 0.0790126 -0.0927332 -0.0314276 -0.1001878 0.0253598 -0.0843995 0.0079039 -0.0126761 0.0967344 0.1911434 0.2482137 0.134799 0.13899 0.5053143 0.1680675 -0.0549737 -0.0280544 -0.1203341 0.0775588 0.0120678 0.025906 0.0224492 0.0644485 0.0356216 0.0263021 0.031226 0.113654 0.0976417 -0.0033031 0.0195877 -0.0082656 0.0497938 0.0219654 0.0306587 0.0197031 0.1063359 0.0744491 0.0246862 0.0453022 -0.0052216 0.0866883 0.0237539 0.0131686 0.034344 0.0853642 0.3109494 0.0126638 -0.0432253 0.0117827 0.1414074 -0.038495 -0.0160597 -0.1040557 0.1913456 0.7093333 0.4617034 0.2997793 0.5530979 1.2121742 -0.1289552 0.3623679 -0.2161831 0.9100021 -0.0002537 0.0317096 -0.1005766 0.0325114 0.0705616 -0.0445874 -0.0599897 -0.0302941 -0.1114885 -0.0250966 -0.0733331 0.0666843 -0.0845532 -0.0847044 0.0067374 0.038677 0.0082015 0.0900103 -0.0137998 -0.0328542 0.0078483 0.0195137 0.1091427 -0.0123857 0.0794863 0.0471551 0.079826 -0.0122469 0.1124782 -0.0082499 0.0912048 -0.1434547 0.0611792 -0.0143566 0.0790841 0.0565006 -0.0067389 -0.0644206 -0.0764982 -0.0302176 0.0670544 -0.0159693 -0.068907 -0.0618875 -0.131659 -0.0922669 0.0713819 0.1087708 0.0759978 -0.0103093 -0.0440982 0.1460124 -0.0506078 -0.0164387 0.0297406 -0.0338435 -0.0731589 -0.0549137 0.0186925 -0.0379074 -0.1326609 -0.0253701 -0.1138423 0.0267144 -0.0029344 -0.131371 -0.0142743 0.0104115 -0.0702814 -0.0936141 -0.0476663 -0.0215452 -0.0703971 -0.0772845 0.1223176 -0.0758446 -0.0382809 0.054902 0.0822026 0.0426182 0.0197334 0.0125003 0.106635 0.0010624 0.0395523 -0.0342254 0.0634417 0.0213601 0.0313888 0.0018684 -0.0366042 -0.0247411 -0.009061 -0.0436349 0.0615911 -0.0197441 -0.0675194 -0.058862 -0.0252083 0.3503337 0.0066316 -0.0687574 0.0376915 0.3102754 0.0836278 -0.1133164 0.043845 0.1507921 unknown
polarizability: 89.1229465|5.2245641|109.9047207|-1.3576223|10.707501|92.1445409 unknown
InChI: InChI=1S/C7H12N2O3/c10-7(11)6-4-2-1-3-5-9(6)8-12/h6,10H,1-5H2
charge 0 multiplicity 1
24 atoms
O  2.008919 1.705279 0.669776
O  1.384581 -0.376672 1.486465
O  -0.206692 -2.790516 -2.089098
N  -0.126339 -0.890007 -0.884723
N  0.373627 -1.653734 -1.939352
C  -0.315452 1.642596 -1.043071
C  0.568339 0.395946 -0.744105
C  -1.400551 1.980661 0.00212
C  -2.453353 0.873043 0.24555
C  -1.883657 -0.404617 0.911408
C  -1.226614 -1.418801 -0.040791
C  1.322507 0.486288 0.587916
H  -0.783995 1.468478 -2.031052
H  0.366265 2.506055 -1.147713
H  1.350716 0.360364 -1.530599
H  -1.917017 2.899793 -0.337928
H  -0.917535 2.238606 0.967052
H  -3.243119 1.288399 0.901095
H  -2.948338 0.607545 -0.711385
H  -1.182449 -0.127663 1.72023
H  -2.709903 -0.956177 1.400874
H  -0.827205 -2.276558 0.5343
H  -1.975869 -1.839594 -0.740258
H  2.530331 1.732586 1.517588
