program: Gaussian 09
title: 000269035
version: EM64L-G09RevD.01
frameworkgroup: C1[X(C13H5BrFNO3)]
method: RPBEPBE
basis: SDD
operation: Freq
keyword: #p
keyword: freq=noraman
keyword: PBEPBE/SDD
title: #p freq=noraman PBEPBE/SDD
converged: NO YES NO NO
title: Mulliken charges:
elementType: Br F O O O N C C C C C C C C C C C C C H H H H H
charge: 0.118297 -0.185994 -0.130194 -0.170970 -0.186917 0.000102 0.298298 0.294432 0.246111 0.226444 -0.281539 -0.335024 -0.548718 -0.348460 -0.554045 0.566266 -0.431042 -0.364742 0.353451 0.272828 0.326686 0.257010 0.310247 0.267473
chargesum: 0.00000
title: Mulliken charges with hydrogens summed into heavy atoms:
elementType: Br F O O O N C C C C C C C C C C C C C
charge: 0.118297 -0.185994 -0.130194 -0.170970 -0.186917 0.000102 0.298298 0.294432 0.246111 0.226444 -0.281539 -0.062196 -0.222033 -0.091450 -0.243798 0.566266 -0.431042 -0.097269 0.353451
polarizability: 3.32565077e+02 5.57637269e+00 2.02711961e+02 2.43273251e+00 -3.79679875e+00 6.59233283e+01
1716.lowfreq: -5.6229 -5.1658 -2.0215 -0.0009 -0.0008 -0.0008 43.4589 49.3522 56.1968
frequency: 43.4533 49.3504 56.1950 101.2705 125.2044 153.4066 159.8058 187.1533 219.3362 225.2038 257.0384 262.8342 320.0254 366.0777 381.1403 418.7509 447.1030 453.7891 498.3278 527.9647 544.3496 579.5393 602.6777 620.7706 649.2527 666.2458 717.9474 724.7908 736.9254 764.8125 771.8260 818.5130 837.9736 889.6694 896.0006 910.1882 954.1433 958.5616 972.5616 1017.0683 1071.7201 1094.8681 1131.4289 1144.5655 1191.8746 1204.5978 1234.6528 1237.3558 1266.4419 1350.7482 1361.6735 1387.6442 1392.9182 1434.2174 1450.8850 1479.5330 1579.2514 1597.4113 1603.9090 1617.8762 1641.9990 3150.2283 3163.5890 3174.0591 3175.7661 3181.5159
redmass: 13.6441 15.8160 8.6443 11.7123 8.7093 6.2636 18.9593 5.6957 12.1104 20.3378 9.4056 12.6115 9.6771 7.1135 6.9254 3.3128 3.2731 10.6570 7.4835 5.9829 6.3911 6.8048 6.8289 6.5772 6.9187 5.9461 10.2125 6.7615 6.2799 3.4321 10.1873 3.8783 1.4321 7.5974 1.5697 1.5626 1.5987 1.4310 4.0516 5.2972 2.4092 2.0130 1.6334 5.0130 2.9523 10.5242 3.6391 1.3791 1.6236 5.9660 11.2125 3.9107 9.2357 3.3698 3.9579 5.2310 9.7079 8.3722 8.1741 8.0071 11.4776 1.0908 1.0928 1.0931 1.0941 1.0959
irintensity: 0.2358 0.8237 1.2009 0.6454 1.2904 0.1061 1.0178 4.3374 1.0492 0.8126 0.8525 1.1832 3.5057 2.5527 2.8450 6.3391 0.9771 21.4952 2.9237 14.5531 5.7707 3.8171 9.2774 6.6094 1.4046 6.7423 27.1348 1.7232 8.6581 0.5581 3.1310 23.7409 39.7693 80.0924 11.8196 12.0052 23.6729 3.5364 37.3345 14.6102 1.7431 9.7423 16.8661 3.5982 284.2622 260.3043 68.8167 23.0675 10.9529 23.7698 12.7010 30.4116 69.4803 26.2151 186.7885 14.7339 76.6003 259.4598 48.3067 61.5559 135.3873 3.8515 0.6920 5.5422 4.1673 3.1678
temp: 298.150 k
press: 1.00000 atm
elementType: 35 9 8 8 8 7 6 6 6 6 6 6 6 6 6 6 6 6 6 1 1 1 1 1
symmnumber: 1
zpe: 390030.3 jmol-1
zpe.correction: 0.148555 hartree
zpe.thermalcorrener: 0.163596 hartree
zpe.thermalcorrenthalpy: 0.164541 hartree
zpe.thermalcorrgfe: 0.104504 hartree
zpe.sumelectzpe: -890.734793 hartree
zpe.sumelectthermal: -890.719752 hartree
zpe.sumelectthermalent: -890.718808 hartree
zpe.sumelectthermalfe: -890.778844 hartree
dipole: -3.2841 -5.4300 -0.0885
dipole: 6.3465
quadrupole: -138.0255 -118.2643 -117.5538
quadrupole: -1.1983 -1.4216 1.8385
quadrupole: -13.4109 6.3502 7.0608 -1.1983 -1.4216 1.8385
hfenergy: -890.8833481 hartree
pointgroup: C01 [X(C13H5Br1F1N1O3)]
dipole: 1.6358258 1.8810697 0.1420616 debye
dipolederiv: -0.2765231 0.333264 0.0036409 0.4265345 -0.3774323 -0.032459 -0.011471 -0.010419 0.0565246 -1.4677692 0.1062932 0.02613 0.1797452 -0.1981852 -0.007653 0.0356415 -0.0067177 -0.1446489 -0.5212896 0.050403 0.0083206 0.176042 -1.0335326 -0.072379 0.0202795 -0.0761542 -0.2896379 -0.858115 -0.0039874 0.1936903 0.0890369 -0.3289421 -0.166535 0.191135 -0.1645316 -0.38028 -0.6211992 -0.2153579 -0.0357343 -0.3370604 -0.6055856 -0.2675768 -0.049022 -0.2136443 -0.3950876 1.8549615 0.4627573 -0.1689443 0.42591 0.7715463 0.5100132 -0.1359601 0.4080286 0.5875295 0.8813251 -0.10745 -0.0185961 -0.1502335 0.2578343 0.0197555 -0.0295417 0.008036 0.0316075 -0.2598075 0.0732142 0.0111288 0.0291914 -0.0324077 0.0005234 0.0191019 0.0004764 -0.0213732 -0.97404 0.1781752 0.0214625 -0.055722 -0.3464915 -0.0303639 -0.0070003 -0.0332628 0.0237116 -0.3919626 -0.2917785 -0.0244643 -0.3019578 -0.2041452 -0.0212016 -0.0253032 -0.022112 0.0311621 1.3717924 -0.089677 -0.0198008 -0.1999784 1.2607886 0.1113093 -0.0201455 0.1255895 0.1345416 -0.9204019 0.3720245 0.0293591 0.3623683 -0.0946907 0.0006395 0.0485331 0.0065249 -0.0728248 0.5612566 -0.0160479 0.0060684 -0.0340299 0.006547 0.0082721 -0.1294245 -0.025089 -0.057752 0.0528497 -0.0821439 -0.0110296 0.0491207 0.1154487 0.0238928 0.0047778 0.0254974 -0.1149328 -0.2382453 0.0738053 0.0088516 -0.3281204 0.0407886 0.0190091 -0.0385028 0.0133126 -0.1043019 -0.9137159 -0.0747285 0.0293032 -0.0672869 -0.3037522 -0.0825692 0.0056094 -0.0477097 0.0432057 0.9482116 -0.70135 -0.0360568 -0.3714838 0.7818338 0.0267205 0.1200527 0.0591102 -0.116549 -0.2247772 0.0666039 0.0084524 0.3612433 -0.0448598 0.0045228 0.0380386 0.0080322 -0.1290185 1.6075539 -0.1200834 -0.0296737 -0.2325916 0.1855956 0.0125208 -0.0435276 0.0108287 0.0962698 0.0748745 -0.043814 -0.002807 -0.0346488 -0.0081147 -0.0119091 -0.0199733 -0.0065499 0.1499029 0.1056104 0.0094873 -0.0047138 -0.0014423 0.0886812 0.0013923 0.0228778 -0.0128791 0.1634893 0.0799359 0.0762371 0.008787 0.0381374 -0.0306513 -0.0192242 0.0034667 -0.0199315 0.1506302 0.1035482 -0.0002455 0.0007204 0.0446188 0.0541725 -0.013713 0.0055915 -0.0130164 0.1805739 0.0259267 -0.0556011 -0.0040947 -0.0673926 0.0455542 -0.0129876 -0.0052337 -0.0134191 0.1772577 unknown
polarizability: 330.6050221|-15.8536417|202.2052612|-6.5228646|18.5578998|68.3900832 unknown
InChI: InChI=1S/C13H5BrFNO3/c14-11-4-8-7-2-1-6(15)3-9(7)13(17)10(8)5-12(11)16(18)19/h1-5H
charge 0 multiplicity 1
24 atoms
Br -3.579827 2.704079 0.224118
F  5.646492 -0.024602 -0.08334
O  0.935425 -2.880021 -0.31862
O  -4.957863 0.045706 0.729951
O  -4.356195 -1.646982 -0.679055
N  -4.093483 -0.591986 0.021324
C  0.037902 0.594957 0.046011
C  1.51953 0.666458 0.035855
C  -0.354658 -0.771406 -0.089494
C  2.029943 -0.660338 -0.106478
C  0.878103 -1.629719 -0.191632
C  -0.935165 1.600343 0.150829
C  -1.698978 -1.141352 -0.113694
C  2.400939 1.758266 0.139039
C  3.405358 -0.927375 -0.150274
C  -2.684073 -0.127397 0.022075
C  -2.308507 1.239082 0.146523
C  3.796685 1.513197 0.097563
C  4.259812 0.189833 -0.04504
H  -0.662317 2.656146 0.231272
H  -2.010436 -2.183003 -0.232926
H  2.035041 2.783845 0.250073
H  3.798034 -1.942188 -0.258866
H  4.521639 2.328555 0.173889
