program: Gaussian 09
title: 000269047
version: EM64L-G09RevD.01
frameworkgroup: C1[X(C21H13NO4)]
method: RPBEPBE
basis: SDD
operation: Freq
keyword: #p
keyword: freq=noraman
keyword: PBEPBE/SDD
title: #p freq=noraman PBEPBE/SDD
converged: YES YES NO NO
title: Mulliken charges:
elementType: O O O O N C C C C C C C C C C C C C C C C C C C C C H H H H H H H H H H H H H
charge: -0.245432 -0.262901 -0.254777 -0.202042 -0.081072 0.291080 0.313668 0.149082 0.070859 -0.531054 0.254535 -0.362497 -0.354759 0.059293 -0.352719 -0.349645 0.219625 0.498382 0.174197 -0.494582 -0.237089 -0.232992 -0.375699 -0.336065 -0.395113 -0.203206 0.249683 0.235293 0.264915 0.277189 0.249310 0.297245 0.235033 0.239786 0.233996 0.255923 0.218110 0.242436 0.242001
chargesum: 0.00000
title: Mulliken charges with hydrogens summed into heavy atoms:
elementType: O O O O N C C C C C C C C C C C C C C C C C C C C C
charge: -0.245432 -0.262901 -0.254777 -0.202042 -0.081072 0.291080 0.313668 0.149082 0.070859 -0.281371 0.254535 -0.127204 -0.089844 0.059293 -0.075531 -0.100335 0.219625 0.498382 0.174197 -0.197337 -0.002056 0.006795 -0.141704 -0.080142 -0.177003 0.281231
polarizability: 5.60332276e+02 -7.57733709e+00 2.67627567e+02 5.55583337e+00 -4.53309184e+00 1.08487259e+02
1716.lowfreq: -9.5757 -2.9295 -0.0002 0.0005 0.0007 2.4902 17.5825 26.5387 30.9820
frequency: 17.4529 26.4000 30.6395 33.9663 67.3801 85.3378 108.9999 128.0631 143.6947 172.0742 202.8450 212.7837 225.9711 255.5516 275.3052 313.4938 348.6915 378.1958 389.4677 397.7964 420.7198 431.4051 440.5032 444.6097 472.5807 491.9037 508.4522 535.9301 589.3692 596.3137 599.9230 623.9412 631.0399 648.9190 664.7584 680.9488 700.0661 723.8067 730.6141 734.7697 768.5400 773.8897 786.7321 796.3335 811.9620 829.3367 841.0610 844.4493 891.6452 893.3253 899.4555 910.5690 932.2963 935.1010 954.1079 962.6395 978.2576 978.8796 980.2265 1005.9193 1017.5851 1046.4277 1059.4719 1066.4372 1091.5784 1120.7909 1127.2747 1134.4512 1161.4267 1178.6762 1188.2620 1197.8120 1227.4670 1242.3797 1257.9933 1264.1007 1274.6912 1311.6940 1345.3273 1366.0113 1382.3114 1387.9571 1403.3308 1421.7291 1438.1971 1456.6549 1472.8386 1483.7233 1487.3579 1492.2474 1556.8444 1579.3345 1581.3862 1606.0540 1615.5445 1622.6886 1625.8663 1664.7691 2950.5629 3018.6413 3098.5032 3136.8739 3137.7588 3142.6446 3151.6272 3161.8477 3168.2230 3173.4498 3175.1125 3185.0937 3188.2686
redmass: 6.3116 6.5935 2.3797 6.3288 7.2818 4.6758 6.2027 7.7083 5.4855 7.2072 7.6327 3.8378 5.9485 5.3809 5.8711 9.0360 4.6664 6.8577 5.7999 6.8839 3.3462 3.4314 3.8109 5.0188 8.4128 5.7883 3.3503 7.4147 6.5805 6.2300 4.5145 6.5396 4.1606 6.6649 4.2248 9.5730 6.6436 4.1862 3.3451 6.9683 6.5044 3.6792 1.5105 4.5567 1.3519 1.6216 9.5218 7.2221 2.0440 3.1260 1.5180 1.4272 1.3578 3.4907 1.3920 7.4332 2.2281 2.6687 1.3892 1.3451 3.4969 1.9754 3.7287 1.4539 2.5480 1.0368 1.5923 1.3772 2.0925 1.1410 2.0129 2.3086 3.2849 1.8138 1.3486 3.7890 1.4493 2.0412 2.0758 1.3237 5.8371 5.3036 3.3431 3.4487 2.7292 4.2982 2.6929 3.3856 1.2270 3.2285 6.4736 7.2232 7.7177 7.6019 6.3512 8.1304 7.0225 12.1703 1.0861 1.0534 1.1191 1.0861 1.0900 1.0890 1.0896 1.0945 1.0917 1.0963 1.0994 1.0950 1.0939
irintensity: 3.0286 0.2177 13.8071 0.1338 0.4254 3.5670 0.7574 1.2995 0.2574 0.8237 1.8387 6.7812 0.6692 2.2967 2.6912 6.5979 3.8617 10.2075 3.6075 1.3707 1.6611 7.5191 4.0414 6.4425 11.6244 7.3656 0.7509 8.0984 3.4080 1.4650 3.3898 16.8414 14.9851 1.0622 35.5816 0.2240 0.5700 7.6857 0.7465 2.1699 16.2723 9.9512 51.7226 9.8006 32.9475 70.8116 11.6330 27.7887 3.2187 2.1219 10.1148 27.8151 5.5897 17.9867 7.7870 333.2970 78.6811 95.3710 1.1068 0.1792 2.1821 3.2467 31.4467 4.3563 38.2227 0.0049 10.9522 13.0959 40.3732 13.5847 121.4698 37.0480 19.7341 11.5348 19.1732 452.1747 4.6114 15.9131 32.7936 6.5284 1.5829 39.0908 50.6205 22.9620 49.1859 236.9194 18.0958 133.4465 21.8451 34.1687 45.0369 189.3629 0.1748 0.5501 42.9651 4.3529 163.6406 469.3769 51.4011 149.4090 28.7568 3.0211 7.5286 5.9605 8.7270 3.1866 8.4805 7.1320 18.5853 4.2122 8.0200
temp: 298.150 k
press: 1.00000 atm
elementType: 8 8 8 8 7 6 6 6 6 6 6 6 6 6 6 6 6 6 6 6 6 6 6 6 6 6 1 1 1 1 1 1 1 1 1 1 1 1 1
symmnumber: 1
zpe: 747108.0 jmol-1
zpe.correction: 0.284558 hartree
zpe.thermalcorrener: 0.304650 hartree
zpe.thermalcorrenthalpy: 0.305594 hartree
zpe.thermalcorrgfe: 0.232991 hartree
zpe.sumelectzpe: -1161.906878 hartree
zpe.sumelectthermal: -1161.886787 hartree
zpe.sumelectthermalent: -1161.885843 hartree
zpe.sumelectthermalfe: -1161.958446 hartree
dipole: 5.6393 2.7614 0.9597
dipole: 6.3519
quadrupole: -151.1255 -131.8869 -152.1647
quadrupole: -21.3552 -3.6279 -1.1140
quadrupole: -6.0665 13.1722 -7.1057 -21.3552 -3.6279 -1.1140
hfenergy: -1162.1914367 hartree
pointgroup: C01 [X(C21H13N1O4)]
dipole: 2.2129609 1.1609993 0.0112242 debye
polarizability: 559.9014723|-2.4290419|244.6373905|16.4341807|-56.1028689|131.9082398 unknown
InChI: InChI=1S/C21H13NO4/c23-21-16-4-2-1-3-15(16)17-10-14(6-8-18(17)26-21)22-11-13-5-7-19-20(9-13)25-12-24-19/h1-11H,12H2
charge 0 multiplicity 1
39 atoms
O  -4.266056 -1.857823 0.374712
O  5.911236 1.659463 -1.253085
O  7.534348 0.570024 0.143462
O  -6.508189 -1.420726 0.23803
N  1.167614 -0.359164 0.084393
C  -2.560213 -0.099212 -0.013775
C  -3.633762 0.877015 -0.261278
C  -2.924054 -1.439518 0.297828
C  -4.99534 0.442796 -0.180168
C  -1.17686 0.20265 -0.077693
C  -0.186123 -0.771893 0.186125
C  -3.384331 2.240854 -0.579025
C  -1.95751 -2.440256 0.529444
C  -5.355384 -0.956483 0.145444
C  -6.061276 1.351812 -0.412813
C  -0.59475 -2.112694 0.477045
C  5.277517 0.726388 -0.394742
C  3.528871 -0.556349 0.64393
C  6.239997 0.087458 0.426467
C  3.922865 0.432489 -0.315919
C  -4.444839 3.134654 -0.80873
C  -5.791813 2.693751 -0.726743
C  4.501837 -1.192816 1.464842
C  5.881763 -0.880516 1.368894
C  2.116164 -0.9252 0.794403
C  7.359243 1.587524 -0.933636
H  -0.829089 1.208381 -0.329032
H  -2.355651 2.606588 -0.646989
H  -2.297868 -3.458943 0.735773
H  -7.086107 0.974346 -0.339961
H  0.156387 -2.896161 0.624445
H  3.166343 0.912569 -0.940447
H  -4.227557 4.18032 -1.052445
H  -6.612914 3.394991 -0.906594
H  4.175384 -1.944821 2.192495
H  6.630807 -1.367495 1.997385
H  1.902428 -1.694618 1.56677
H  7.912532 1.255677 -1.828461
H  7.696551 2.567041 -0.554346
