program: Gaussian 09
title: 000269068
version: EM64L-G09RevD.01
frameworkgroup: C1[X(C19H22Cl2N2O)]
method: RPBEPBE
basis: SDD
operation: Freq
keyword: #p
keyword: freq=noraman
keyword: PBEPBE/SDD
title: #p freq=noraman PBEPBE/SDD
converged: YES YES NO NO
title: Mulliken charges:
elementType: Cl Cl O N N C C C C C C C C C C C C C C C C C C C H H H H H H H H H H H H H H H H H H H H H H
charge: -0.063745 -0.066197 -0.267130 -0.216719 -0.481922 0.291879 0.369369 -0.396047 -0.363285 -0.552639 0.280929 0.333711 -0.547387 -0.849361 -0.586553 -0.584857 -0.857606 0.132986 0.243669 -0.343854 -0.358878 -0.223396 -0.237497 -0.228053 0.251600 0.256303 0.234385 0.267717 0.226048 0.313411 0.235333 0.230857 0.245038 0.267846 0.268176 0.283420 0.263499 0.230425 0.229388 0.247219 0.334555 0.274770 0.214219 0.233841 0.230457 0.234078
chargesum: 0.00000
title: Mulliken charges with hydrogens summed into heavy atoms:
elementType: Cl Cl O N N C C C C C C C C C C C C C C C C C C C
charge: -0.063745 -0.066197 -0.267130 -0.216719 -0.147367 0.291879 0.369369 0.111856 0.138816 -0.326592 0.280929 0.333711 -0.233976 -0.138134 -0.050531 -0.037938 -0.150574 0.132986 0.243669 -0.069084 -0.144659 0.010445 -0.007041 0.006025
polarizability: 4.24905182e+02 -1.34076107e+00 2.52368788e+02 -1.66377358e+01 -2.18151686e+01 1.48625959e+02
1716.lowfreq: -0.0011 0.0013 0.0014 2.5774 3.6601 5.7456 16.6792 19.4616 27.9995
frequency: 16.6007 19.3543 27.9890 35.6690 40.8764 50.3462 60.9780 78.3195 92.1075 105.9117 118.9733 143.6895 158.8345 179.8937 194.1276 198.1336 204.4261 226.8964 232.2620 240.3053 259.0442 269.4884 310.8234 318.8508 355.1295 367.1800 389.9757 402.0930 417.1271 446.2629 450.4637 473.0546 488.1088 537.0635 570.2554 613.3115 624.0739 643.3188 653.7935 673.3783 674.7710 686.7600 699.9090 703.2257 725.8904 740.8707 772.3062 778.2557 789.0722 809.6030 853.1549 863.5885 875.2920 931.0296 931.7175 938.9516 982.2180 988.9703 992.8662 997.1959 1004.9389 1014.1520 1019.7417 1025.3707 1033.1123 1037.4803 1040.2838 1047.2463 1074.1545 1086.9276 1116.1652 1121.0153 1171.6160 1173.9633 1184.5047 1192.0249 1215.2007 1242.9393 1249.3893 1255.5247 1256.8384 1280.0505 1292.0241 1303.9543 1318.1994 1348.1503 1355.2169 1362.9344 1381.9687 1385.7539 1391.8735 1399.2342 1411.7268 1432.0836 1451.6126 1452.7682 1453.9487 1466.3946 1468.2210 1478.8182 1480.7621 1481.4156 1491.3715 1496.8833 1518.8733 1572.6925 1581.7832 1607.1746 1609.8321 1625.9213 2954.3621 2967.9706 2983.1471 3017.6921 3022.3653 3048.7046 3052.5315 3056.9187 3074.9199 3078.7018 3085.6119 3088.7056 3112.2535 3132.6645 3134.7891 3139.7010 3143.7023 3145.2158 3158.9794 3170.5276 3176.1867 3544.8563
redmass: 5.3327 7.7749 4.6236 6.3029 12.4433 7.8290 4.7595 5.0864 2.4480 3.6692 2.4181 5.4171 2.9227 3.4041 1.4950 3.6322 3.6863 3.9977 3.3633 3.6710 1.2028 3.1047 6.2436 3.0106 4.4933 4.1758 4.0291 2.8175 4.7559 3.5371 4.4361 3.9081 4.2994 4.1209 4.0489 5.0822 1.6607 5.2999 2.6347 5.5147 6.0444 5.0130 4.1040 1.5716 4.2079 3.1947 1.2259 1.2109 2.3532 3.9439 1.2684 1.4387 5.3871 1.3615 1.5987 2.2986 1.4331 4.9625 1.5845 1.5620 1.3449 1.5616 2.2868 2.6628 3.3182 2.4144 1.5333 1.5241 2.3103 1.6618 1.5100 2.5987 2.6023 1.0592 1.8300 1.1326 2.1020 1.4129 2.3398 1.5396 1.2448 1.3435 1.5031 1.4952 1.3527 1.3179 1.3091 2.5833 4.0378 4.6012 1.3034 1.3167 3.6885 2.2196 1.4703 1.1107 1.1572 1.0911 1.1464 1.4467 1.2048 1.1566 1.1147 1.4937 2.7463 7.3351 4.2661 5.4628 6.0122 5.9583 1.0399 1.0401 1.0664 1.0606 1.0979 1.0934 1.0571 1.0567 1.0970 1.1010 1.0949 1.0987 1.0878 1.0867 1.0936 1.1083 1.1118 1.0919 1.0956 1.1006 1.0923 1.0753
irintensity: 1.3575 0.1668 0.9682 0.5283 0.7964 1.2938 1.7169 2.6022 0.9061 0.9293 0.8606 3.0152 6.0392 0.4901 3.9614 0.5762 13.9257 2.1103 3.5768 0.3085 0.4653 1.4248 9.5409 1.6223 4.5154 5.8139 10.0034 0.1331 2.0899 6.9220 4.7259 10.5305 2.0757 4.1343 5.7921 4.8547 44.8386 54.9368 15.8396 55.0406 24.3289 20.8230 42.8315 106.1597 9.5166 1.4716 4.7497 8.1750 20.2385 2.7823 1.2990 13.5349 11.2393 9.7306 14.5946 17.0907 2.8538 1.7642 45.4791 3.8655 1.3991 1.6029 31.3416 1.7748 0.7577 3.3997 2.1485 13.3735 49.0763 6.1482 34.8265 17.2832 47.2872 1.0535 18.6581 17.5951 16.6247 4.3516 98.7258 74.3053 9.9099 11.9833 27.0251 5.1400 0.3018 12.8733 15.1110 38.0018 14.2611 8.4359 23.7049 6.9872 159.0191 10.5512 93.5053 47.9784 51.0627 12.5816 46.5098 8.2494 30.1860 12.8635 25.9243 32.6613 502.1779 83.1649 12.5433 57.8070 3.4470 26.4774 37.1946 33.7214 37.5107 33.8511 20.3050 17.7015 17.3098 22.1307 11.0371 10.8973 18.0555 13.2852 16.3070 0.4197 26.7012 16.3366 20.6737 21.3527 16.7254 25.6105 7.8530 15.3756
temp: 298.150 k
press: 1.00000 atm
elementType: 17 17 8 7 7 6 6 6 6 6 6 6 6 6 6 6 6 6 6 6 6 6 6 6 1 1 1 1 1 1 1 1 1 1 1 1 1 1 1 1 1 1 1 1 1 1
symmnumber: 1
zpe: 970045.1 jmol-1
zpe.correction: 0.369471 hartree
zpe.thermalcorrener: 0.394011 hartree
zpe.thermalcorrenthalpy: 0.394956 hartree
zpe.thermalcorrgfe: 0.311285 hartree
zpe.sumelectzpe: -1840.321805 hartree
zpe.sumelectthermal: -1840.297264 hartree
zpe.sumelectthermalent: -1840.296320 hartree
zpe.sumelectthermalfe: -1840.379991 hartree
dipole: 2.7806 3.1144 -1.4862
dipole: 4.4317
quadrupole: -151.3591 -165.3138 -160.6635
quadrupole: 12.1906 -12.6025 -7.3457
quadrupole: 7.7531 -6.2017 -1.5514 12.1906 -12.6025 -7.3457
hfenergy: -1840.6912752 hartree
pointgroup: C01 [X(C19H22Cl2N2O1)]
dipole: -1.1136062 1.2573605 0.4679422 debye
polarizability: 425.1255209|1.9405623|255.3763216|-14.6788574|12.3546494|145.3980869 unknown
InChI: InChI=1S/C19H22Cl2N2O/c1-14-13-18(23(10-8-20)11-9-21)15(2)12-17(14)22-19(24)16-6-4-3-5-7-16/h3-7,12-13,22H,8-11H2,1-2H3
charge 0 multiplicity 1
46 atoms
Cl 6.091017 3.335894 -0.366106
Cl 5.494148 -2.961102 1.977249
O  -2.705437 -1.814531 -0.747606
N  3.765335 -0.135391 -0.550035
N  -1.900637 0.2167 0.124078
C  2.338607 -0.094112 -0.392945
C  1.491804 -1.133347 -0.893858
C  4.50427 1.08466 -0.925087
C  4.551223 -1.291476 -0.078555
C  1.72864 1.031513 0.229956
C  0.336273 1.159382 0.395004
C  -0.494418 0.090042 -0.062641
C  0.094945 -1.031159 -0.696611
C  2.020491 -2.31134 -1.693286
C  5.204926 1.782415 0.260609
C  4.518976 -1.420589 1.457733
C  -0.250994 2.395117 1.057906
C  -2.916636 -0.673243 -0.228644
C  -4.315994 -0.194436 0.072848
C  -5.321777 -1.183922 0.221469
C  -4.675478 1.176632 0.173032
C  -6.654342 -0.814152 0.494878
C  -6.011765 1.546453 0.441648
C  -7.003282 0.552586 0.610979
H  5.274488 0.832328 -1.681251
H  3.801441 1.789722 -1.400129
H  5.595635 -1.168931 -0.418919
H  4.183587 -2.236622 -0.510883
H  2.365251 1.83658 0.613209
H  -0.562069 -1.821686 -1.065598
H  2.865596 -2.008531 -2.337628
H  2.36944 -3.141564 -1.047628
H  1.224491 -2.721063 -2.33732
H  5.997464 1.164585 0.708973
H  4.502975 2.130219 1.032783
H  3.497431 -1.574517 1.835821
H  5.001219 -0.577861 1.975183
H  -0.815223 2.150671 1.980798
H  -0.934314 2.945889 0.379929
H  0.54604 3.099025 1.348446
H  -2.200369 1.055402 0.623458
H  -5.032367 -2.233819 0.109781
H  -3.936239 1.968639 -0.003141
H  -7.420884 -1.587412 0.614806
H  -6.281153 2.606418 0.505089
H  -8.039433 0.840934 0.819505
