program: Gaussian 09
title: 000269005
version: EM64L-G09RevD.01
frameworkgroup: C1[X(C16H15NO4)]
method: RPBEPBE
basis: SDD
operation: Freq
keyword: #p
keyword: freq=noraman
keyword: PBEPBE/SDD
title: #p freq=noraman PBEPBE/SDD
converged: YES YES NO NO
title: Mulliken charges:
elementType: O O O O N C C C C C C C C C C C C C C C C H H H H H H H H H H H H H H H
charge: -0.307075 -0.297582 -0.446582 -0.255264 -0.221796 0.403769 -0.472858 0.467399 -0.313024 -0.352602 0.271890 0.325549 -0.370643 -0.349968 -0.667181 -0.366301 -0.384492 -0.227021 -0.226007 -0.231274 0.102216 0.247635 0.223482 0.311439 0.250502 0.269468 0.271913 0.236806 0.240684 0.292033 0.269698 0.232720 0.230443 0.228427 0.231376 0.382224
chargesum: 0.00000
title: Mulliken charges with hydrogens summed into heavy atoms:
elementType: O O O O N C C C C C C C C C C C C C C C C
charge: -0.307075 -0.297582 -0.064358 -0.255264 -0.221796 0.403769 -0.001742 0.467399 -0.001585 -0.102100 0.271890 0.325549 -0.101176 -0.078054 0.102341 -0.096604 -0.151773 0.003421 0.002420 0.000103 0.102216
polarizability: 3.03639512e+02 2.15834647e+01 1.86828961e+02 -5.30717687e+00 -1.23362558e+01 1.23194870e+02
1716.lowfreq: -4.8220 -0.0004 0.0003 0.0006 3.0215 6.1399 14.9598 17.3798 33.3135
frequency: 14.9129 16.9472 33.1799 39.6913 59.6520 75.4715 93.5619 111.7156 152.1887 178.8375 211.6814 231.5884 241.0558 269.8956 305.0483 332.2172 352.3154 387.1164 404.6439 414.4003 418.7828 449.9260 489.0873 503.4380 514.7272 570.7466 587.5223 593.6773 611.8346 617.2140 635.8065 687.1777 693.1677 702.9670 708.1685 758.0190 761.7373 771.6218 816.3355 830.1227 837.1716 859.6703 878.9109 930.6436 942.5165 973.6938 978.5328 984.1677 990.7251 993.7421 1002.3755 1009.1723 1022.2340 1027.0396 1090.2080 1096.8890 1102.3978 1122.6637 1141.7581 1155.6328 1174.1071 1189.7631 1214.0734 1221.2159 1228.7768 1237.9746 1313.8560 1323.4896 1324.6139 1331.3327 1351.1082 1382.5150 1385.8687 1427.7006 1441.2226 1442.5119 1463.4647 1484.6862 1486.6200 1500.3246 1506.0180 1568.2321 1594.6053 1611.5339 1614.9587 1632.5701 1644.0578 2992.9613 3042.9109 3076.4322 3115.4253 3119.7712 3129.6258 3142.0452 3153.3754 3156.2785 3166.1380 3166.5962 3168.2537 3188.8495 3212.7868 3531.4208
redmass: 5.2803 4.9445 4.3059 4.3184 6.2798 6.0908 7.5549 5.6055 5.7681 5.7538 5.1132 3.3813 1.4449 6.5007 5.0757 3.5412 3.5614 4.3341 2.8200 2.9960 2.9884 4.1154 5.2252 5.2083 2.8494 5.1498 1.3784 3.4886 4.6551 6.1888 6.8927 4.1362 7.7934 3.1067 2.2384 2.3886 4.3585 5.5402 3.5582 4.8619 1.3779 1.2483 1.5235 2.2381 2.3055 1.9025 1.3602 1.4227 5.3849 4.7959 1.3333 1.3304 2.9238 2.2172 1.5966 4.2263 1.7667 1.3197 1.4619 1.6138 1.0540 1.1168 1.2343 2.8840 2.8229 1.2640 1.6781 1.9902 2.6218 1.2629 1.4913 6.1130 8.0650 3.2990 1.2222 2.1603 1.1376 2.1045 1.1214 1.0524 2.5598 7.5557 6.0985 6.9304 6.0733 7.7582 8.5196 1.0394 1.0583 1.1014 1.1068 1.0882 1.0872 1.0920 1.0962 1.0916 1.0891 1.1015 1.0950 1.0950 1.0936 1.0641
irintensity: 0.0096 0.4845 0.6721 2.2218 1.2875 0.6733 1.0069 0.2846 1.1417 0.0338 0.3598 3.7446 0.2263 9.2867 2.7839 3.3525 3.4787 24.9496 0.9069 4.1259 3.1161 31.1858 1.4119 7.5875 39.2558 23.7973 89.1427 7.2649 43.7693 2.9723 2.1966 83.1605 1.2638 14.4279 62.1370 44.5639 24.9474 12.1589 9.3406 22.1289 15.9549 0.2605 49.5261 128.3511 72.5019 47.8460 0.9324 4.0162 1.6864 220.3669 0.8945 0.2670 241.6763 3.0864 18.1611 266.7758 347.2857 13.0396 156.8176 138.1107 0.0636 1.3865 10.2501 36.0406 58.9317 3.6212 22.2681 333.7415 272.2181 2.2893 179.7572 0.3652 0.9470 3.1974 38.0719 9.0498 41.4782 9.3762 66.8115 31.8816 113.2393 13.7490 5.2143 304.1571 36.3161 42.5225 409.9635 40.0083 37.5668 22.1734 3.0716 7.6105 1.8181 19.3654 24.7595 1.6563 2.7100 20.0519 0.5268 8.2797 8.0297 51.9037
temp: 298.150 k
press: 1.00000 atm
elementType: 8 8 8 8 7 6 6 6 6 6 6 6 6 6 6 6 6 6 6 6 6 1 1 1 1 1 1 1 1 1 1 1 1 1 1 1
symmnumber: 1
zpe: 731207.9 jmol-1
zpe.correction: 0.278502 hartree
zpe.thermalcorrener: 0.297287 hartree
zpe.thermalcorrenthalpy: 0.298231 hartree
zpe.thermalcorrgfe: 0.227845 hartree
zpe.sumelectzpe: -972.870732 hartree
zpe.sumelectthermal: -972.851947 hartree
zpe.sumelectthermalent: -972.851003 hartree
zpe.sumelectthermalfe: -972.921389 hartree
dipole: 3.2260 3.5616 -1.9352
dipole: 5.1804
quadrupole: -113.0393 -115.5168 -122.2834
quadrupole: -8.6510 2.4225 0.9235
quadrupole: 3.9072 1.4297 -5.3369 -8.6510 2.4225 0.9235
hfenergy: -973.1492345 hartree
pointgroup: C01 [X(C16H15N1O4)]
dipole: 1.2234625 1.3278775 0.9454585 debye
polarizability: 300.877432|10.4199503|148.3065936|26.9013199|34.1419615|164.4793171 unknown
InChI: InChI=1S/C16H15NO4/c1-17(14-9-7-13(8-10-14)15(18)19)16(20)21-11-12-5-3-2-4-6-12/h2-10,18H,11H2,1H3
charge 0 multiplicity 1
36 atoms
O  1.947966 0.069104 1.608713
O  0.808996 -1.458363 0.25792
O  -6.364921 0.804334 -1.029118
O  -5.739878 -1.09909 -2.203997
N  -0.212038 0.575619 0.951967
C  -1.501414 0.352982 0.360887
C  3.160009 -0.823598 1.514811
C  4.054734 -0.425751 0.362066
C  -1.774757 -0.729772 -0.530128
C  -2.559192 1.263253 0.663261
C  -4.099491 0.03212 -0.790841
C  0.829686 -0.360955 0.874827
C  -3.05306 -0.877191 -1.090573
C  -3.834659 1.103929 0.096471
C  -0.000895 1.842143 1.69816
C  3.864966 -0.992712 -0.925151
C  5.096373 0.51727 0.555785
C  4.700402 -0.616458 -1.99982
C  5.93286 0.893675 -0.518322
C  5.735734 0.326667 -1.799156
C  -5.426014 -0.17399 -1.41367
H  2.802886 -1.862753 1.421255
H  3.646446 -0.665247 2.489976
H  -0.98831 -1.444924 -0.766538
H  -2.401831 2.097324 1.349694
H  -3.258214 -1.705928 -1.776272
H  -4.635168 1.807655 0.340769
H  -0.588579 1.852241 2.634256
H  -0.300408 2.698371 1.069828
H  1.060965 1.933562 1.94936
H  3.055412 -1.715461 -1.075685
H  5.251423 0.955842 1.549499
H  4.547064 -1.058865 -2.990311
H  6.736619 1.620922 -0.358323
H  6.385461 0.615582 -2.632982
H  -7.227578 0.602362 -1.480815
