program: Gaussian 09
title: 000268976
version: EM64L-G09RevD.01
frameworkgroup: C1[X(C10H7BrClNO)]
method: RPBEPBE
basis: SDD
operation: Freq
keyword: #p
keyword: freq=noraman
keyword: PBEPBE/SDD
title: #p freq=noraman PBEPBE/SDD
converged: NO YES NO NO
title: Mulliken charges:
elementType: Br Cl O N C C C C C C C C C C H H H H H H H
charge: 0.022919 -0.037565 -0.260807 -0.435551 0.405932 0.214666 0.363784 0.149796 -0.457963 -0.385455 -0.345722 -0.196579 -0.142541 -0.803878 0.318382 0.256609 0.307588 0.277507 0.244034 0.244050 0.260796
chargesum: 0.00000
title: Mulliken charges with hydrogens summed into heavy atoms:
elementType: Br Cl O N C C C C C C C C C C
charge: 0.022919 -0.037565 -0.260807 -0.117169 0.405932 0.214666 0.363784 0.149796 -0.201354 -0.385455 -0.038134 0.080928 -0.142541 -0.054998
polarizability: 2.03278771e+02 5.75093675e+00 1.88929512e+02 1.47815336e-02 3.12212222e-03 5.68600066e+01
1716.lowfreq: -0.0018 -0.0003 0.0022 3.2502 7.0249 9.1172 52.8355 95.8699 104.4481
frequency: 52.8211 95.8626 104.4462 129.6049 153.2881 170.1835 179.6225 203.7905 255.6234 280.8651 341.1085 359.4329 366.6538 471.7675 498.0668 510.4151 546.7628 547.7826 584.1277 606.2136 636.2935 683.2001 724.5448 766.6745 799.2326 860.6768 864.6871 871.6335 939.3303 986.6439 1010.0533 1050.6303 1072.0596 1106.6824 1162.3069 1204.5437 1253.6948 1280.3658 1347.0947 1378.8485 1398.5834 1406.7198 1433.1452 1459.3187 1467.5677 1498.7404 1546.0495 1563.6480 1601.9841 1642.7966 2979.8808 3055.2253 3120.0245 3165.5505 3180.0745 3180.5356 3504.2720
redmass: 6.1753 1.1592 6.2367 8.7764 17.3753 5.2451 4.2568 3.7347 10.4705 5.5485 6.7904 6.4360 5.8916 4.9858 6.5323 7.4726 4.0608 6.1136 3.6794 5.2819 1.3821 3.0828 9.1163 4.0200 6.0878 5.3664 1.4846 1.3951 1.3948 3.5134 1.7005 1.5225 1.7607 5.0143 2.2700 1.6030 2.3555 2.3755 2.2457 3.5632 2.8326 1.6876 3.0780 1.2971 1.0432 3.3694 6.9391 5.1562 8.1912 5.4828 1.0394 1.0979 1.0968 1.0926 1.0927 1.0935 1.0773
irintensity: 4.8013 0.0298 0.1599 2.5821 0.7201 0.7535 0.0446 0.3098 0.9273 0.9083 16.0260 0.6047 1.0523 2.8166 13.5706 7.9351 7.1976 2.2651 11.7893 6.6584 38.1524 33.9365 88.7376 1.7928 6.5018 12.5283 38.2970 20.8613 12.0801 11.6382 12.3980 9.9589 6.7105 39.3399 13.7747 0.8008 53.2508 0.2752 2.9890 32.2982 18.8822 21.9265 50.5035 112.2977 18.5473 256.9877 204.6723 52.2405 43.4430 141.2663 19.2976 13.5992 9.0079 8.2809 2.8267 0.2173 76.7981
temp: 298.150 k
press: 1.00000 atm
elementType: 35 17 8 7 6 6 6 6 6 6 6 6 6 6 1 1 1 1 1 1 1
symmnumber: 1
zpe: 380781.8 jmol-1
zpe.correction: 0.145032 hartree
zpe.thermalcorrener: 0.157670 hartree
zpe.thermalcorrenthalpy: 0.158614 hartree
zpe.thermalcorrgfe: 0.104636 hartree
zpe.sumelectzpe: -987.800306 hartree
zpe.sumelectthermal: -987.787668 hartree
zpe.sumelectthermalent: -987.786724 hartree
zpe.sumelectthermalfe: -987.840702 hartree
dipole: 3.9336 5.0511 0.0004
dipole: 6.4021
quadrupole: -82.5337 -114.3202 -99.7313
quadrupole: 2.3382 0.0017 0.0003
quadrupole: 16.3281 -15.4585 -0.8696 2.3382 0.0017 0.0003
hfenergy: -987.9453382 hartree
pointgroup: C01 [X(C10H7Br1Cl1N1O1)]
dipole: 1.2707983 2.1746984 0.0001614 debye
dipolederiv: -0.1091288 -0.076106 -0.0000121 0.0228106 -0.72326 -0.0000216 -0.0000113 -0.0000327 -0.0124187 -0.8638141 -0.2216444 -0.0000837 -0.2738848 -0.1966589 -0.0000308 -0.0000843 -0.0000246 -0.0544067 -0.4920574 -0.0623498 -0.0000184 0.1035852 -1.2792709 -0.000041 -0.0000093 0.0000013 -0.3603361 -1.2268329 0.2758993 -0.0000917 0.0095944 -0.638472 -0.0000222 -0.000111 0.0000271 -0.2289536 0.7445339 -0.0018769 0.0000694 0.3661824 -0.3347145 0.0000313 0.0000976 -0.0000205 0.0973191 -0.2676146 0.5128806 -0.0000088 0.0712875 -0.1880344 0.000001 -0.0000089 0.0000314 -0.0030001 0.8252588 -0.2880497 0.0000666 -0.1539561 0.9708127 0.0000183 0.0000374 -0.000032 0.0303319 0.8197791 0.0923119 0.0000753 -0.2095778 1.354561 0.0000305 0.0000469 0.0000382 0.1644732 -0.3597134 -0.5391853 -0.0000312 -0.1398792 -0.584998 -0.0000258 -0.000019 -0.0000739 -0.228077 -0.0795161 0.0194641 0.0000034 0.0241066 1.2728291 0.0000476 0.0000045 0.0000528 -0.1456998 -0.2803528 -0.2587786 -0.0000315 0.0626625 -0.0394239 0.0000103 -0.0000155 -0.0000228 -0.0619428 -0.2674158 -0.0036856 -0.0000207 -0.2056155 -0.1929484 -0.0000224 -0.0000302 -0.0000042 -0.0314914 1.2141676 0.4515796 0.0001356 0.4606211 0.1028981 0.0000488 0.0001335 0.0000468 -0.0873301 -0.1636608 -0.0194805 -0.0000268 -0.1558774 -0.0111593 -0.0000047 0.0000353 0.000034 0.0714152 0.2526734 -0.0262928 -0.0000057 -0.0582508 0.2539639 -0.0000077 -0.0000059 -0.0000049 0.2864573 -0.0454659 0.0475495 -0.0000243 0.0593648 0.063724 0. -0.0000282 0.0000038 0.1663334 0.1462814 0.0247336 -0.0000003 -0.0662024 0.0709272 -0.0000112 -0.0000026 -0.0000003 0.1611287 0.0574596 0.0535011 -0.0000079 0.0501142 0.0712099 0.0000014 -0.0000061 0.0000008 0.1626591 0.0477956 -0.0106698 0.0234682 -0.0564056 0.0119961 -0.1029116 -0.0327776 -0.1155737 -0.0262793 0.0477779 -0.0107309 -0.0234249 -0.0564429 0.0120449 0.1028706 0.0327975 0.1155408 -0.0263148 -0.0001546 0.0409305 -0.0000304 0.1457632 0.0039734 0.0000393 -0.0000429 0.0000126 0.1261324 unknown
polarizability: 201.5172913|7.432792|190.6909919|0.0142379|0.0050522|56.8600066 unknown
InChI: InChI=1S/C10H7BrClNO/c1-5-2-9(14)7-3-6(12)4-8(11)10(7)13-5/h2-4,13H,1H3
charge 0 multiplicity 1
21 atoms
Br -0.762818 3.466129 0.000153
Cl -4.206021 -1.048127 -0.000327
O  0.898502 -2.967685 0.000136
N  1.416523 1.148998 0.000296
C  0.11287 0.654829 0.000139
C  -0.102231 -0.758404 0.000061
C  2.534967 0.318386 0.000386
C  1.064754 -1.70052 0.000114
C  2.376313 -1.057079 0.000315
C  -1.023809 1.512725 0.000062
C  -1.419649 -1.279094 -0.000083
C  -2.328858 1.00621 -0.000079
C  -2.506636 -0.400573 -0.000148
C  3.873656 1.018785 0.000546
H  1.538807 2.165677 0.000346
H  3.257227 -1.703671 0.000403
H  -1.535241 -2.367405 -0.000142
H  -3.19085 1.677693 -0.000135
H  3.990697 1.660919 0.894399
H  3.991017 1.660701 -0.893422
H  4.691481 0.283105 0.000778
