program: Gaussian 09
title: 000268985
version: EM64L-G09RevD.01
frameworkgroup: C1[X(C16H13N3O4S)]
method: RPBEPBE
basis: SDD
operation: Freq
keyword: #p
keyword: freq=noraman
keyword: PBEPBE/SDD
title: #p freq=noraman PBEPBE/SDD
converged: YES YES NO NO
title: Mulliken charges:
elementType: S O O O O N N N C C C C C C C C C C C C C C C C H H H H H H H H H H H H H
charge: 0.997514 -0.501742 -0.502827 -0.219878 -0.270918 -0.723221 0.028057 -0.013968 0.409668 0.118201 0.344142 -0.028209 -0.095976 -0.350091 -0.347211 -0.237800 -0.238430 -0.287769 0.450415 -0.355643 -0.369585 -0.179233 -0.361093 -0.794784 0.395174 0.284621 0.273124 0.287554 0.279511 0.313674 0.250153 0.249035 0.235041 0.248001 0.234343 0.232991 0.247158
chargesum: 0.00000
title: Mulliken charges with hydrogens summed into heavy atoms:
elementType: S O O O O N N N C C C C C C C C C C C C C C C C
charge: 0.997514 -0.501742 -0.502827 -0.219878 -0.270918 -0.328047 0.028057 -0.013968 0.409668 0.118201 0.344142 -0.028209 -0.095976 -0.065470 -0.074087 0.049755 0.041081 0.025905 0.450415 -0.105490 -0.120550 0.055807 -0.113092 -0.080292
polarizability: 3.39410715e+02 -2.87350347e+01 2.31151240e+02 -1.23342022e+01 -2.88014605e+01 2.07767271e+02
1716.lowfreq: -13.7748 -5.3760 -0.0018 -0.0018 -0.0014 6.0745 8.2751 11.7147 14.4677
frequency: -9.9967 11.5816 13.8127 32.6656 45.0872 58.6308 89.5658 105.9990 116.2367 132.1941 165.6579 192.1142 203.5445 205.6686 228.4190 272.5132 287.2484 304.8453 308.8727 357.5285 379.6574 390.3803 394.7757 404.1111 405.8059 425.5586 441.9455 496.1221 500.0787 535.6805 538.8387 562.6210 584.5395 617.4258 621.3658 641.1505 652.8373 696.9827 704.3053 742.7922 750.5835 771.8263 774.8957 785.5228 816.5216 820.5028 826.7861 842.9219 852.2564 859.6183 945.6337 946.0256 957.1620 960.7926 981.2115 990.1346 991.4900 994.7012 998.9538 1003.1896 1048.9423 1050.0840 1053.7149 1092.9208 1122.2814 1137.0809 1161.6303 1187.4669 1219.7949 1220.2852 1240.6433 1250.4734 1290.8691 1298.8516 1327.2764 1352.4195 1369.0498 1382.1863 1392.1862 1399.7430 1400.5530 1430.6342 1445.7979 1469.9524 1471.0489 1475.3364 1498.6909 1533.1698 1573.7851 1592.0953 1594.1283 1620.7421 2983.0584 3066.0344 3094.5835 3096.5339 3133.9016 3140.5140 3141.9877 3159.0849 3163.5219 3163.7668 3167.0194 3178.3326 3223.8443
redmass: 1.2332 6.6743 3.2321 3.9707 5.9166 6.7634 5.8604 6.4873 6.8687 6.3343 9.4837 7.8196 6.7493 6.8084 8.4636 8.0816 5.4293 4.6966 6.1743 7.4989 3.6010 7.9422 10.7739 4.1575 3.0013 11.3671 7.1938 3.9634 3.0986 6.6054 3.9053 7.0334 6.4797 6.2266 6.8204 5.4537 4.9321 7.0975 3.2843 9.3811 4.5915 2.7786 4.0119 1.6230 1.5783 4.8842 1.3444 1.2855 4.8171 1.6118 1.7977 3.5142 9.5106 1.3091 1.3941 5.3632 1.5959 1.5884 1.7968 1.4609 2.2714 1.6818 2.3390 3.8491 1.2919 2.0887 1.4709 1.1440 2.5112 1.9915 1.9985 1.9962 3.7268 1.2646 6.3665 4.9110 2.1121 6.3154 2.9058 2.6043 1.2161 3.0929 3.2182 1.1356 2.1547 1.0734 3.6356 6.2467 6.1213 5.9364 6.9345 6.7494 1.0393 1.0944 1.0804 1.1001 1.0895 1.0891 1.0891 1.0888 1.0958 1.0957 1.0968 1.0986 1.0938
irintensity: 0.7317 0.8188 0.8939 0.4049 1.4545 0.0950 3.2894 1.0445 3.9656 1.1741 1.1085 6.7187 1.6213 1.4390 11.0755 7.1126 17.7761 8.5660 1.5221 1.9311 2.9503 64.0730 1.9643 5.1565 0.9752 141.2204 3.1408 8.9068 59.2537 58.2999 4.2677 68.8238 87.1765 6.6438 1.4795 20.4369 4.2307 0.7417 2.7505 4.9886 46.5775 2.9635 6.7214 45.0827 33.8027 174.1955 63.4231 7.7425 3.9492 44.2697 8.3744 23.8115 31.6576 2.9371 0.6229 3.1537 2.9421 11.1020 20.7382 9.3199 35.2597 12.3896 0.3666 179.0397 4.2775 50.4120 4.0070 16.5758 34.0122 108.5369 38.1419 4.0477 235.0056 3.6563 66.4268 13.5666 96.9490 0.5784 11.0441 7.1593 18.5667 55.0680 100.2114 15.3785 26.9995 12.2979 253.4132 5.5657 11.7152 14.1829 0.0358 156.7589 17.8267 19.3999 238.3880 13.1499 15.3702 9.6066 5.5146 6.9721 27.0388 0.7490 7.3117 3.1410 8.7140
temp: 298.150 k
press: 1.00000 atm
elementType: 16 8 8 8 8 7 7 7 6 6 6 6 6 6 6 6 6 6 6 6 6 6 6 6 1 1 1 1 1 1 1 1 1 1 1 1 1
symmnumber: 1
zpe: 688785.3 jmol-1
zpe.correction: 0.262344 hartree
zpe.thermalcorrener: 0.283054 hartree
zpe.thermalcorrenthalpy: 0.283998 hartree
zpe.thermalcorrgfe: 0.209682 hartree
zpe.sumelectzpe: -1478.774908 hartree
zpe.sumelectthermal: -1478.754199 hartree
zpe.sumelectthermalent: -1478.753254 hartree
zpe.sumelectthermalfe: -1478.827571 hartree
dipole: 2.3117 6.6567 2.1161
dipole: 7.3576
quadrupole: -121.0655 -156.1731 -155.5398
quadrupole: 12.6421 12.1494 2.3244
quadrupole: 23.1939 -11.9136 -11.2803 12.6421 12.1494 2.3244
hfenergy: -1479.0372527 hartree
pointgroup: C01 [X(C16H13N3O4S1)]
dipole: -0.2209498 -2.5753718 -1.303024 debye
polarizability: 346.3080272|-3.9296251|185.429019|6.1600091|9.6134439|246.5921795 unknown
InChI: InChI=1S/C16H13N3O4S/c1-11-4-6-12(7-5-11)24(22,23)18-15-9-8-14-13(3-2-10-17-14)16(15)19(20)21/h2-10,18H,1H3
charge 0 multiplicity 1
37 atoms
S  -2.156606 1.621945 -0.139599
O  -3.094948 2.260507 1.011327
O  -1.843035 2.392981 -1.534594
O  2.333323 0.067511 3.48692
O  0.3058 0.998389 3.126726
N  -0.581855 1.319158 0.821505
N  1.468483 0.557001 2.661027
N  4.453348 0.028621 -1.34636
C  0.667759 0.997442 0.342637
C  1.741176 0.621479 1.237798
C  3.063648 0.293476 0.717595
C  -2.750384 -0.120879 -0.542319
C  3.256179 0.320612 -0.718864
C  0.925612 1.019432 -1.078161
C  2.166423 0.686205 -1.580381
C  -3.406439 -0.83679 0.472288
C  -2.54832 -0.612158 -1.841094
C  4.225724 -0.039951 1.493874
C  -3.670875 -2.693624 -1.133618
C  -3.864263 -2.134397 0.159128
C  -3.01845 -1.91334 -2.124928
C  5.436799 -0.322283 0.848465
C  5.511871 -0.288462 -0.571692
C  -4.141521 -4.101556 -1.443747
H  -0.672048 1.385819 1.866464
H  0.129642 1.360093 -1.74493
H  2.372242 0.710493 -2.654496
H  -3.573644 -0.392733 1.45882
H  -2.071505 0.006577 -2.607708
H  4.160974 -0.079877 2.578925
H  -4.382876 -2.717556 0.928203
H  -2.880757 -2.322797 -3.131807
H  6.325631 -0.572672 1.435886
H  6.446957 -0.518631 -1.094595
H  -5.042187 -4.366591 -0.86372
H  -4.372801 -4.226491 -2.515353
H  -3.357574 -4.840351 -1.187918
