program: Gaussian 09
title: 000268963
version: EM64L-G09RevD.01
frameworkgroup: C1[X(C12H10ClNO2)]
method: RPBEPBE
basis: SDD
operation: Freq
keyword: #p
keyword: freq=noraman
keyword: PBEPBE/SDD
title: #p freq=noraman PBEPBE/SDD
converged: YES YES NO NO
title: Mulliken charges:
elementType: Cl O O N C C C C C C C C C C C C H H H H H H H H H H
charge: 0.015646 -0.285202 -0.223135 -0.007799 0.429668 -0.061056 -0.341295 0.352709 -0.348218 -0.292474 -0.478484 -0.237237 0.171483 -0.219825 -0.256457 -0.663843 0.257514 0.268324 0.283798 0.235805 0.237896 0.237134 0.225760 0.220392 0.227279 0.251618
chargesum: 0.00000
title: Mulliken charges with hydrogens summed into heavy atoms:
elementType: Cl O O N C C C C C C C C C C C C
charge: 0.015646 -0.285202 -0.223135 -0.007799 0.429668 -0.061056 -0.341295 0.352709 -0.090704 -0.024150 -0.194686 -0.001432 0.171483 0.018071 0.206437 0.035446
polarizability: 2.52882723e+02 -9.99210999e-01 1.60371370e+02 3.49405444e+00 1.96657548e+00 7.06696785e+01
1716.lowfreq: -6.5942 -0.0008 0.0017 0.0024 2.6875 4.5681 25.3862 47.4708 63.1169
frequency: 25.2944 47.4457 63.1154 92.4056 110.4548 139.6500 208.2159 217.0317 219.9370 244.3852 287.4413 305.7832 351.2538 397.1294 419.0555 425.4953 481.6556 519.6256 544.6091 572.7004 586.0042 633.4484 660.8169 730.1535 733.3142 779.2654 793.3963 797.2028 805.2055 817.9722 888.8139 890.7993 943.9848 964.5164 976.0662 1001.7425 1014.6561 1024.6579 1094.1757 1103.6454 1126.4359 1154.3541 1164.6137 1201.6656 1223.3257 1273.4079 1279.9832 1313.8851 1354.8394 1362.2488 1374.4686 1391.8478 1407.2178 1448.0245 1456.7477 1464.0351 1473.1067 1484.1003 1549.9396 1572.5059 1617.7591 1629.0492 2993.7726 3032.1204 3088.7294 3095.0823 3120.9080 3138.7604 3153.3292 3167.3169 3169.2056 3177.7397
redmass: 4.4871 4.0021 5.7540 4.3799 4.3413 3.3520 6.6702 1.3928 5.7109 4.9224 8.2910 3.1146 8.0236 7.3604 3.6352 3.2976 3.9702 6.8058 6.5167 4.4974 6.9821 4.7755 6.6886 6.5108 3.5414 1.3292 4.7894 4.1494 2.4605 1.8203 1.6335 4.5725 1.4574 5.6944 1.3620 1.3319 3.0354 2.2775 2.3054 4.1701 1.8881 1.6992 1.3365 2.8823 1.9632 1.6565 1.1598 3.5473 1.3284 2.6080 3.1870 1.2333 3.6932 2.5015 1.1156 1.0432 3.4254 1.0520 7.0519 8.2123 6.6701 10.0070 1.0361 1.0595 1.0973 1.1032 1.1062 1.0863 1.0898 1.0917 1.0951 1.0999
irintensity: 1.5065 1.3600 0.7790 0.1673 0.4673 1.3045 1.3884 1.4969 1.1807 0.1930 3.6844 6.9680 12.4742 1.1510 2.7668 14.2008 1.7812 2.3189 8.4591 1.3748 3.8215 0.5852 21.2294 5.3993 13.9453 93.3813 7.7707 6.3156 8.2871 2.1054 0.0752 16.6080 13.5274 53.7385 3.9413 0.0433 96.7794 9.2885 121.0045 245.8926 12.0481 56.2583 11.4072 29.3521 105.9252 56.2381 2.5263 20.4082 5.7415 46.8365 21.0436 25.1770 5.2570 2.0186 19.8070 14.8983 67.8006 14.1953 27.7307 104.9380 57.0932 141.5870 20.7145 33.6015 38.6215 0.9214 29.0625 4.0784 7.9990 1.6296 7.3220 21.4832
temp: 298.150 k
press: 1.00000 atm
elementType: 17 8 8 7 6 6 6 6 6 6 6 6 6 6 6 6 1 1 1 1 1 1 1 1 1 1
symmnumber: 1
zpe: 504662.9 jmol-1
zpe.correction: 0.192216 hartree
zpe.thermalcorrener: 0.206374 hartree
zpe.thermalcorrenthalpy: 0.207318 hartree
zpe.thermalcorrgfe: 0.149551 hartree
zpe.sumelectzpe: -1127.407143 hartree
zpe.sumelectthermal: -1127.392985 hartree
zpe.sumelectthermalent: -1127.392041 hartree
zpe.sumelectthermalfe: -1127.449808 hartree
dipole: 0.6491 -0.7357 -0.3496
dipole: 1.0416
quadrupole: -70.3002 -104.3688 -101.9045
quadrupole: 7.5498 2.3723 -1.7856
quadrupole: 21.8910 -12.1776 -9.7133 7.5498 2.3723 -1.7856
hfenergy: -1127.5993586 hartree
pointgroup: C01 [X(C12H10Cl1N1O2)]
dipole: 0.2717342 -0.1985288 -0.2338128 debye
dipolederiv: -0.0723972 0.0668475 0.0131195 0.1321088 -0.637681 -0.2511134 0.037362 -0.2379468 -0.1220239 -1.6067178 -0.3138509 -0.2809867 -0.3764833 -0.4781324 -0.1909491 -0.6062526 -0.2243536 -0.609047 -0.8978518 0.1375837 0.1152738 0.126722 -0.4978828 -0.2357033 0.004357 -0.2307089 -0.5481144 -0.574728 0.017898 -0.0073179 0.079343 -0.3407282 -0.0434111 0.0312895 -0.032811 -0.2491542 -0.2976249 0.1797745 0.0577156 0.313385 -0.3516169 -0.1735188 0.1223791 -0.1854887 0.0076146 0.4226632 0.1682816 0.0967463 -0.2194368 0.141492 0.0266249 -0.0739115 0.0409305 0.0714495 0.6301137 -0.1766832 -0.0395755 -0.0659334 0.9984865 0.428549 0.0772577 0.4294286 0.1258697 -0.9226138 -0.0368218 -0.0602761 -0.0379555 -0.3982025 -0.2232257 -0.0737213 -0.2232461 -0.0598127 -0.0168971 -0.097935 -0.0370825 0.0650604 0.005098 0.0704421 0.0274597 0.0665008 -0.1101733 -0.2347886 -0.0859116 -0.0435072 -0.073 0.0647909 0.0906862 -0.0457188 0.0908144 -0.101114 0.2774184 -0.1247368 -0.0343631 -0.0916157 0.3323348 0.155024 -0.0924868 0.1620591 0.0325352 -0.0082466 0.1636441 0.0813531 0.1542998 -0.00662 0.0698879 0.0778605 0.0707358 -0.1048595 2.2221622 0.0976974 0.2005494 0.1694049 0.6603 0.5071954 0.499887 0.4921286 0.8140452 0.1236111 -0.0929468 -0.0257578 -0.0966416 0.0220353 0.0668573 -0.0292313 0.0676684 -0.1097831 1.0528855 0.1738331 0.1007671 -0.0165712 0.2571142 -0.078006 0.0638786 -0.0112223 0.3235218 -0.1672513 -0.0751289 0.009716 -0.0189295 -0.0001573 0.1013352 0.0387102 0.060565 -0.0739372 0.1011206 0.0453283 0.0179066 -0.0186265 0.0102468 -0.0690695 -0.0075536 -0.0660131 0.1297809 0.0894227 0.0003311 -0.0044285 0.0499455 -0.0055738 -0.072158 0.0193903 -0.0756498 0.1268208 0.046821 -0.0445883 -0.0193135 -0.0797284 0.0615131 -0.0262391 -0.0167769 -0.0363942 0.1055372 -0.0486354 -0.0778284 -0.0470916 -0.0924027 0.0409592 -0.0584922 -0.0528608 -0.0584621 0.1288624 -0.0995099 0.071263 0.0173326 0.0684115 0.0826634 -0.0303111 0.0163976 -0.0301602 0.1455551 -0.0225203 -0.0345653 -0.0124303 0.068719 -0.0903493 0.0332193 0.0667028 -0.02602 0.0899798 -0.0332877 -0.0281373 -0.0313172 -0.0406023 0.0897934 -0.0441811 -0.0687762 -0.0092776 -0.1216588 -0.2103426 0.0012283 -0.0162386 -0.0056437 0.0925306 0.0097289 0.0157611 0.0248479 0.1152641 0.1195685 0.0784251 0.0262652 0.0244207 -0.1222794 -0.008085 0.0275713 -0.0400964 0.0716421 0.127626 -0.0130012 -0.0770588 -0.0182501 0.0698653 -0.0550869 -0.0589746 -0.0178286 -0.0788005 unknown
polarizability: 252.5019433|-0.3330183|143.5391489|8.4880326|35.1326107|87.8826789 unknown
InChI: InChI=1S/C12H10ClNO2/c1-2-16-12(15)9-7-14-10-6-4-3-5-8(10)11(9)13/h3-7H,2H2,1H3
charge 0 multiplicity 1
26 atoms
Cl -0.048724 2.54059 0.889653
O  -2.987114 -0.334015 -1.031619
O  -2.748038 1.228126 0.685016
N  0.831898 -1.669114 -0.93348
C  1.632137 0.463612 0.087826
C  1.864562 -0.847909 -0.493911
C  0.264692 0.888839 0.203758
C  -0.783911 0.065134 -0.232997
C  2.757702 1.244149 0.505202
C  3.204627 -1.324716 -0.632147
C  -0.41976 -1.214472 -0.801964
C  4.055548 0.749424 0.358076
C  -2.234843 0.41053 -0.112619
C  4.283103 -0.541874 -0.213392
C  -4.469157 -0.131887 -0.98777
C  -5.112312 -1.037711 0.065961
H  2.586603 2.231906 0.942811
H  3.340717 -2.316011 -1.074363
H  -1.226136 -1.863323 -1.154544
H  4.908377 1.354915 0.682717
H  5.307399 -0.914166 -0.321737
H  -4.670044 0.93332 -0.778731
H  -4.790673 -0.388272 -2.009658
H  -6.212308 -0.932823 0.021493
H  -4.860266 -2.096858 -0.115038
H  -4.782079 -0.757193 1.079958
