program: Gaussian 09
title: 000268969
version: EM64L-G09RevD.01
frameworkgroup: C1[X(C14H14ClNO2)]
method: RPBEPBE
basis: SDD
operation: Freq
keyword: #p
keyword: freq=noraman
keyword: PBEPBE/SDD
title: #p freq=noraman PBEPBE/SDD
converged: YES YES NO NO
title: Mulliken charges:
elementType: Cl O O N C C C C C C C C C C C C C C H H H H H H H H H H H H H H
charge: -0.048121 -0.255667 -0.254644 -0.025970 0.475107 -0.131711 0.122239 -0.546893 0.451410 -0.209514 -0.617581 -0.284723 -0.320896 -0.340476 -0.811788 0.283815 -0.266346 -0.663527 0.258224 0.279599 0.250728 0.297957 0.264899 0.236972 0.230833 0.232925 0.233032 0.236758 0.226814 0.219641 0.228509 0.248398
chargesum: 0.00000
title: Mulliken charges with hydrogens summed into heavy atoms:
elementType: Cl O O N C C C C C C C C C C C C C C
charge: -0.048121 -0.255667 -0.254644 -0.025970 0.475107 -0.131711 0.122239 -0.288669 0.451410 -0.209514 -0.087254 0.013234 -0.055997 -0.103505 -0.114998 0.283815 0.197225 0.033020
polarizability: 2.71877687e+02 1.06051619e+01 1.83176478e+02 -1.64013880e+01 2.47763368e+00 9.70841979e+01
1716.lowfreq: -6.6118 -5.3974 0.0009 0.0015 0.0017 7.5440 12.9406 24.0216 46.2922
frequency: 12.3685 23.8441 46.2500 68.4840 81.4594 97.2047 108.2206 142.8433 168.8383 181.8277 192.8354 208.5461 229.0009 278.9233 311.3261 334.6116 367.7265 381.3909 403.6423 421.4748 468.6391 484.7407 524.3747 530.4717 549.8554 595.1281 631.8298 653.8168 681.6227 721.6564 782.5940 792.4031 805.4798 813.6530 837.0776 840.7566 889.9657 900.1361 903.0080 930.8376 957.0726 980.7446 983.4642 1009.0026 1014.7968 1049.6640 1093.6881 1104.0562 1124.1547 1152.5533 1156.9812 1208.7057 1209.9578 1254.0978 1267.5228 1277.2543 1282.1655 1314.2532 1337.2386 1356.3649 1382.2845 1391.5354 1397.6645 1400.3033 1439.5695 1450.4663 1457.8345 1463.1260 1468.8030 1480.5655 1484.5390 1489.8602 1543.4664 1583.0937 1630.6294 1634.2609 2977.3054 2988.0297 2994.1288 3032.5627 3054.2403 3089.1004 3090.1172 3095.7558 3118.1255 3122.0069 3127.1053 3145.2235 3167.0389 3184.9033
redmass: 4.2803 6.4666 3.5109 3.5672 1.0601 4.1147 5.2266 4.9288 6.1127 2.6465 2.3446 4.2192 2.2862 2.3498 3.7880 3.9517 3.7524 7.9058 3.9945 3.5410 3.8587 4.7379 3.6716 5.1417 4.0929 6.5570 4.3259 3.8633 5.7198 3.9150 3.1427 3.0526 4.6847 1.5918 1.7175 3.1129 1.9002 1.9169 1.9347 2.8030 2.4133 3.2948 1.3350 1.5824 2.9393 1.5613 2.2177 2.0440 1.8502 1.4771 1.6705 1.6519 1.5630 1.8848 2.9577 1.1278 3.0161 2.1554 2.8687 1.3394 4.0562 1.2358 2.8718 1.4658 1.1474 1.9738 1.0971 1.0440 1.0455 1.5307 1.0522 3.4432 6.2432 8.3979 8.7731 6.7243 1.0376 1.0672 1.0361 1.0599 1.0973 1.0974 1.0987 1.1027 1.0927 1.1064 1.0893 1.0916 1.0958 1.0938
irintensity: 0.9245 1.0814 0.5869 1.2342 0.4413 0.5722 2.3609 1.7341 1.3794 1.1073 1.2833 1.6233 4.1852 7.5369 1.3813 19.5792 6.0784 3.6729 3.2312 5.3416 3.7444 7.8529 5.2007 2.1424 4.2031 0.0798 9.0695 10.0690 17.3334 10.7967 2.0784 5.3141 1.8190 17.5811 31.9416 36.4237 29.2950 6.1874 10.2067 9.0482 7.0811 3.7003 1.6559 7.4403 82.1543 13.1532 128.9319 172.6391 0.4398 17.1882 17.3205 31.8530 130.1916 1.8981 24.0337 3.9594 95.3154 63.3346 34.7179 9.5906 0.2027 25.9005 29.7958 19.2785 40.1117 44.7565 13.1356 14.7712 13.9353 4.9816 13.0235 49.7277 37.0080 105.9008 142.5712 5.4576 34.0551 5.2972 21.7786 26.3206 18.6419 34.2588 15.7944 1.3199 0.9126 31.5632 14.6193 6.1091 9.9058 8.7354
temp: 298.150 k
press: 1.00000 atm
elementType: 17 8 8 7 6 6 6 6 6 6 6 6 6 6 6 6 6 6 1 1 1 1 1 1 1 1 1 1 1 1 1 1
symmnumber: 1
zpe: 648473.2 jmol-1
zpe.correction: 0.246990 hartree
zpe.thermalcorrener: 0.264435 hartree
zpe.thermalcorrenthalpy: 0.265379 hartree
zpe.thermalcorrgfe: 0.198731 hartree
zpe.sumelectzpe: -1205.870308 hartree
zpe.sumelectthermal: -1205.852863 hartree
zpe.sumelectthermalent: -1205.851919 hartree
zpe.sumelectthermalfe: -1205.918567 hartree
dipole: -0.0784 -1.5113 0.3200
dipole: 1.5468
quadrupole: -79.9752 -116.8575 -110.8374
quadrupole: 0.9357 -0.2233 -1.2909
quadrupole: 22.5815 -14.3008 -8.2807 0.9357 -0.2233 -1.2909
hfenergy: -1206.1172985 hartree
pointgroup: C01 [X(C14H14Cl1N1O2)]
dipole: 0.0368734 -0.6066528 0.031114 debye
polarizability: 271.7872169|-13.8802885|175.9653153|-15.004896|-23.532573|104.3858313 unknown
InChI: InChI=1S/C14H14ClNO2/c1-3-18-14(17)8-10-7-12(15)11-6-9(2)4-5-13(11)16-10/h4-7H,3,8H2,1-2H3
charge 0 multiplicity 1
32 atoms
Cl 1.42127 3.105816 -0.863232
O  -4.150308 -0.936996 -0.03565
O  -3.381481 1.235866 -0.391064
N  0.104504 -1.024292 0.834885
C  1.913487 0.440487 -0.078919
C  1.423516 -0.818344 0.456531
C  -0.765751 -0.004411 0.699284
C  3.291574 0.564373 -0.439328
C  4.18087 -0.5063 -0.287948
C  0.932063 1.476387 -0.199836
C  -2.190367 -0.271119 1.175071
C  -0.390892 1.281191 0.175047
C  2.347856 -1.901001 0.602631
C  3.685312 -1.748021 0.241113
C  5.644073 -0.381811 -0.668152
C  -3.268912 0.120347 0.171627
C  -5.29863 -0.67905 -0.965693
C  -6.467795 -0.035153 -0.216375
H  3.645103 1.519719 -0.841258
H  -2.27982 -1.336709 1.429062
H  -2.380069 0.319155 2.094735
H  -1.147812 2.060315 0.062655
H  1.960893 -2.84137 1.006503
H  4.380862 -2.587739 0.360011
H  5.87953 0.621687 -1.060439
H  6.299565 -0.567892 0.203605
H  5.91925 -1.122332 -1.442801
H  -4.942582 -0.034901 -1.788549
H  -5.548982 -1.682295 -1.344957
H  -7.333863 0.066039 -0.896447
H  -6.77545 -0.655399 0.643123
H  -6.196312 0.970851 0.144867
