program: Gaussian 09
title: 000268955
version: EM64L-G09RevD.01
frameworkgroup: C1[X(C12H10ClNO)]
method: RPBEPBE
basis: SDD
operation: Freq
keyword: #p
keyword: freq=noraman
keyword: PBEPBE/SDD
title: #p freq=noraman PBEPBE/SDD
converged: NO NO NO NO
title: Mulliken charges:
elementType: Cl O N C C C C C C C C C C C C H H H H H H H H H H
charge: -0.022325 -0.216446 -0.028995 0.473688 -0.109535 0.305008 -0.479120 -0.198483 -0.332234 -0.333199 0.147720 -0.291160 0.114919 -0.782325 -0.788995 0.299552 0.267833 0.248525 0.260315 0.257111 0.233695 0.233612 0.239098 0.239073 0.262668
chargesum: 0.00000
title: Mulliken charges with hydrogens summed into heavy atoms:
elementType: Cl O N C C C C C C C C C C C C
charge: -0.022325 -0.216446 -0.028995 0.473688 -0.109535 0.305008 -0.179568 -0.198483 -0.064401 -0.084674 0.147720 -0.030846 0.114919 -0.057907 -0.048155
polarizability: 2.45665826e+02 1.05635770e+00 1.65515391e+02 -1.97983028e-02 9.15494157e-03 6.66249595e+01
1716.lowfreq: -0.0024 -0.0016 -0.0013 4.6310 6.1282 9.6641 48.6414 61.2829 96.6051
frequency: 48.6268 61.2576 96.5862 123.5551 138.1604 167.0708 180.8976 191.4595 211.0893 253.2489 303.1576 329.6050 383.7186 421.7021 436.6603 487.7323 505.9383 526.5110 535.8253 569.3452 592.1520 610.1199 670.2531 681.7796 789.1233 793.6443 809.5241 848.9618 880.6690 911.8526 953.4352 959.4625 976.1239 986.8670 1006.4279 1027.6202 1045.3208 1069.5275 1129.6879 1169.4946 1221.0540 1262.0012 1271.8393 1294.4843 1337.8667 1371.8450 1375.1600 1390.3604 1393.3095 1448.8494 1450.5771 1454.8002 1464.3850 1465.8009 1486.8850 1540.6700 1579.5343 1594.2637 1632.1003 2980.8816 2981.2816 3057.5531 3065.5009 3119.6984 3119.8270 3148.7755 3153.3793 3161.7384 3173.7663
redmass: 5.7645 3.8236 1.0377 8.6416 5.1877 3.8808 1.2061 3.0886 5.1984 4.4180 4.0195 5.3750 11.3536 3.5131 4.2856 4.3566 3.2160 6.0941 5.1512 3.8749 4.3517 3.5263 6.3325 3.1049 3.2240 5.5576 7.4753 1.6220 1.3532 4.8414 1.4334 2.5554 2.3043 1.3481 1.8577 1.8546 1.5805 2.0700 1.8165 1.4726 1.9552 1.9141 6.4781 2.5727 3.8229 1.3683 2.9085 1.2529 6.4561 1.1641 2.7029 1.4551 1.0497 1.0463 2.6054 6.4590 7.3890 8.1494 7.6120 1.0386 1.0375 1.0969 1.0968 1.0993 1.0980 1.0878 1.0912 1.0936 1.0969
irintensity: 4.6857 1.1366 0.6961 1.6735 0.0068 0.6099 2.8656 2.4583 3.3908 3.3922 0.6627 1.7769 4.4510 4.4948 1.5381 5.2166 0.0231 1.9166 14.4046 1.2149 15.7952 0.0899 16.6733 10.4879 2.7352 7.6586 30.2806 35.1978 21.4341 15.1766 20.7072 23.6821 9.7477 1.2303 6.9740 0.4948 6.1222 2.5709 4.7697 22.6694 191.5791 88.5754 55.7357 5.2832 3.5233 30.6746 60.1981 19.3822 49.1257 14.1744 137.4659 22.9468 20.8681 17.9974 15.1301 25.3437 21.1113 224.2809 46.4696 15.3704 2.6882 15.5212 11.5136 19.9419 7.1690 4.4676 1.9181 1.1178 8.8553
temp: 298.150 k
press: 1.00000 atm
elementType: 17 8 7 6 6 6 6 6 6 6 6 6 6 6 6 1 1 1 1 1 1 1 1 1 1
symmnumber: 1
zpe: 489765.4 jmol-1
zpe.correction: 0.186542 hartree
zpe.thermalcorrener: 0.200105 hartree
zpe.thermalcorrenthalpy: 0.201049 hartree
zpe.thermalcorrgfe: 0.145715 hartree
zpe.sumelectzpe: -1052.274100 hartree
zpe.sumelectthermal: -1052.260537 hartree
zpe.sumelectthermalent: -1052.259593 hartree
zpe.sumelectthermalfe: -1052.314927 hartree
dipole: -1.6592 -2.7210 0.0003
dipole: 3.1869
quadrupole: -81.2642 -98.2270 -95.7643
quadrupole: -14.0300 -0.0050 0.0007
quadrupole: 10.4876 -6.4752 -4.0125 -14.0300 -0.0050 0.0007
hfenergy: -1052.4606417 hartree
pointgroup: C01 [X(C12H10Cl1N1O1)]
dipole: 0.7137041 1.0308966 0.0001104 debye
dipolederiv: -0.1070471 -0.1266012 0.0000122 -0.0014384 -0.8120098 0.0000807 0.0000097 0.0000658 -0.0469147 -0.9205755 -0.0867579 -0.0000373 -0.4808686 -0.7518262 0.0000584 -0.0000374 0.0000037 -0.307782 -0.806203 0.039103 -0.0000875 0.1703552 -0.4010894 0.0000707 -0.0000409 0.0000047 -0.2363499 -0.2510323 -0.1007663 -0.0000297 0.0466486 -0.5015164 0.000071 -0.0000473 0.0000809 0.0671999 0.499808 0.0641212 0.000028 -0.1678509 0.1604671 -0.0000282 -0.0000285 -0.0000062 0.0675906 -0.9802613 0.0682057 -0.0001138 0.0702066 -0.0992809 0.0000116 -0.0000507 0.0000139 -0.0074415 0.2043377 -0.007999 0.0000213 -0.1100845 0.0117603 -0.0000249 0.0000387 -0.0000212 -0.0923703 0.442224 0.2394446 0.000011 -0.138015 1.2926989 -0.000139 -0.0000006 -0.0001173 -0.0534867 -0.3131713 0.0481889 -0.0000228 0.1086772 0.1078958 -0.0000246 -0.0000009 -0.0000217 -0.1470743 0.0922951 -0.0918042 0.0000381 0.0817282 0.0724697 -0.0000477 0.0000711 -0.0000443 -0.1424528 0.900798 0.0571782 0.0002283 0.2525869 0.5181676 0.0000074 0.0007187 0.0000586 0.0288263 -0.4404534 -0.2864854 0.0000435 -0.3827666 -0.4758965 -0.0000353 -0.0000296 -0.000065 -0.0929921 2.0021144 -0.0556184 0.0002043 0.255427 0.856059 -0.0001213 0.0001796 -0.0001178 0.1201239 -0.3891633 -0.0658455 -0.0001878 -0.0007695 0.0014663 0.0000626 -0.001319 -0.0000437 0.0447548 -0.3791 0.217708 -0.0001169 0.3499251 -0.2637303 0.0001588 -0.0002946 0.0002329 0.0480542 0.1341042 -0.0095165 0.0000046 -0.0094478 0.0453546 0.0000173 0.0000124 0.0000124 0.1516166 0.0770254 -0.053141 0.0000016 -0.0175689 -0.0362918 0.0000243 -0.0000165 0.0000286 0.1566192 0.0049264 0.1110202 -0.0000277 0.1071263 0.0154062 0.0000299 -0.0000278 0.0000214 0.142851 0.0191901 0.0699127 -0.0000168 0.0789592 0.0525136 0.0000241 0.000018 0.0000227 0.1616081 0.098509 0.0305336 -0.0000701 -0.0750808 -0.085086 0.0004252 0.0003263 0.0004156 0.1204424 0.0030191 0.0033409 -0.0633693 -0.0026119 0.0717492 0.0876948 -0.1155062 0.0554901 -0.0329613 0.0029377 0.0036715 0.0634426 -0.0019268 0.0710525 -0.0882313 0.1158905 -0.0558943 -0.0321222 0.0999023 -0.0169753 0.0622274 -0.0091711 0.0407924 0.0889542 0.0336076 0.09405 -0.0201866 0.0999281 -0.0170649 -0.0622284 -0.0092082 0.0405814 -0.0890657 -0.0335566 -0.0941707 -0.0200139 -0.0941121 -0.0338532 0.0000451 -0.114831 0.0682927 0.0000272 0.0000841 0.0000008 0.1224612 unknown
polarizability: 245.5190364|-3.5860229|165.6621798|0.0192347|-0.0102865|66.6249595 unknown
InChI: InChI=1S/C12H10ClNO/c1-7-5-11(13)10-6-9(8(2)15)3-4-12(10)14-7/h3-6H,1-2H3
charge 0 multiplicity 1
25 atoms
Cl 1.132851 -3.168482 0.000527
O  -3.716404 -1.462447 -0.000034
N  2.109156 1.388402 0.000055
C  0.403648 -0.444734 0.000211
C  0.788623 0.956197 0.000051
C  -1.970819 0.202756 0.00002
C  -0.977481 -0.790825 0.000193
C  1.485743 -1.391893 0.000366
C  -0.240606 1.950937 -0.000141
C  -1.58697 1.587186 -0.000168
C  3.084447 0.456867 0.00024
C  2.805341 -0.959532 0.00037
C  -3.4175 -0.234804 0.000007
C  4.520596 0.930436 0.000469
C  -4.502435 0.837788 -0.000351
H  -1.289204 -1.840842 0.000325
H  0.078476 2.997133 -0.000266
H  -2.355992 2.366332 -0.000349
H  3.634157 -1.67363 0.000485
H  4.547713 2.030645 -0.001699
H  5.062832 0.561566 0.891866
H  5.064493 0.557809 -0.888323
H  -4.420448 1.487071 -0.89268
H  -4.420316 1.488012 0.891265
H  -5.489799 0.350552 -0.000041
