program: Gaussian 09
title: 000268948
version: EM64L-G09RevD.01
frameworkgroup: C1[X(C11H12N2)]
method: RPBEPBE
basis: SDD
operation: Freq
keyword: #pfreq=noraman
keyword: PBEPBE/SDD
title: #p freq=noraman PBEPBE/SDD
converged: NO YES NO NO
title: Mulliken charges:
elementType: N N C C C C C C C C C C C H H H H H H H H H H H H
charge: -0.707539 0.004743 0.370357 0.159655 0.099245 0.384861 0.402403 -0.735818 -0.352082 -0.841812 -0.515083 -0.844335 -0.389162 0.220410 0.213741 0.239420 0.228321 0.227198 0.256829 0.235062 0.235008 0.235444 0.234453 0.327908 0.310772
chargesum: 0.00000
title: Mulliken charges with hydrogens summed into heavy atoms:
elementType: N N C C C C C C C C C C C
charge: -0.068858 0.004743 0.370357 0.159655 0.099245 0.384861 0.402403 -0.515408 -0.138341 -0.146873 -0.258254 -0.138821 -0.154709
polarizability: 1.94358436e+02 -8.11928704e+00 1.55226099e+02 -1.49985393e-02 -4.83603640e-02 6.29494711e+01
1716.lowfreq: -11.5763 -10.7394 -0.0009 -0.0007 -0.0006 4.8447 44.4894 110.5746 128.2731
frequency: 43.9539 110.5649 128.2651 162.9845 185.5493 250.0448 273.8426 303.1049 328.7535 334.7111 378.8323 396.7375 415.3848 418.0490 465.9065 522.5486 545.0727 555.2177 606.4359 638.5414 695.3768 707.2453 782.4134 809.6931 835.1246 876.5686 894.7928 921.6480 962.5503 988.7876 1020.4755 1036.5104 1045.5747 1048.6407 1064.5222 1080.5627 1146.8114 1204.4980 1245.1770 1277.8176 1309.0766 1368.2344 1387.5150 1398.8677 1404.3285 1420.2273 1426.2239 1448.6211 1467.7792 1471.5526 1478.2141 1485.6686 1503.3013 1576.3628 1582.2572 1630.0721 1640.4299 2949.6126 2976.9576 3011.2784 3054.2752 3084.7527 3108.1122 3109.8429 3123.3210 3129.8992 3159.1832 3570.5871 3709.8731
redmass: 1.3633 2.8727 2.1375 3.1822 1.1319 2.8259 3.6199 2.9529 2.7053 3.0243 1.2293 2.6324 1.2065 6.3266 5.5237 5.0794 3.1340 3.0590 4.5128 5.4053 3.3389 5.0176 5.0625 2.4483 1.5385 1.6169 2.1950 1.5155 1.4248 1.9824 2.4326 1.5086 1.7534 1.5925 2.5972 2.3649 3.0562 1.6093 1.5856 1.9999 3.2046 2.0338 2.5134 1.2461 1.6124 2.3523 4.0834 2.8229 1.7449 1.0453 1.0446 1.2671 1.7172 7.8424 5.5802 3.4476 1.3833 1.0422 1.0373 1.0977 1.0973 1.0988 1.0916 1.0910 1.0892 1.0877 1.0962 1.0450 1.1034
irintensity: 1.0424 0.8745 0.5563 5.1545 0.2059 3.5796 0.1309 2.0536 0.6213 2.8245 236.3344 9.0734 33.8482 0.3409 0.9131 0.0357 4.3882 0.2054 6.6150 5.9640 1.6826 2.5832 7.5133 3.4719 31.2100 39.8831 4.6554 1.8524 0.0001 4.1039 10.0449 1.1228 11.3962 8.4517 3.6836 0.2260 6.5959 7.7808 8.6964 9.2383 62.9569 41.8441 2.0509 9.3584 11.8565 2.5807 38.3962 27.1021 1.5183 14.4390 12.3237 27.9842 61.1672 24.8406 16.4472 71.8474 328.0388 49.0524 29.7717 27.5225 17.3403 18.0071 9.0121 32.0647 24.2561 9.2897 41.1727 80.1888 22.1136
temp: 298.150 k
press: 1.00000 atm
elementType: 7 7 6 6 6 6 6 6 6 6 6 6 6 1 1 1 1 1 1 1 1 1 1 1 1
symmnumber: 1
zpe: 536499.5 jmol-1
zpe.correction: 0.204342 hartree
zpe.thermalcorrener: 0.216152 hartree
zpe.thermalcorrenthalpy: 0.217097 hartree
zpe.thermalcorrgfe: 0.166980 hartree
zpe.sumelectzpe: -534.964056 hartree
zpe.sumelectthermal: -534.952246 hartree
zpe.sumelectthermalent: -534.951302 hartree
zpe.sumelectthermalfe: -535.001419 hartree
dipole: -5.8581 0.3949 0.0145
dipole: 5.8714
quadrupole: -74.5741 -64.2411 -82.0462
quadrupole: 1.0785 -0.0544 -0.0233
quadrupole: -0.9536 9.3794 -8.4258 1.0785 -0.0544 -0.0233
hfenergy: -535.1683981 hartree
pointgroup: C01 [X(C11H12N2)]
dipole: -2.3061015 -0.1265233 -0.0439562 debye
dipolederiv: -1.6279156 -0.05165 -0.019878 -0.3218997 -0.1553502 -0.0134684 -0.0214824 -0.0073834 -0.7095858 -0.622645 0.1215185 -0.0083935 0.1323907 -0.4744345 0.0038131 -0.0087405 0.0038543 -0.2610769 0.7172676 -0.0139667 0.0143815 0.1497547 -0.0792468 0.0033549 0.0137908 0.0004703 0.0699697 -0.4608527 0.0091173 -0.0100125 -0.284257 -0.3064516 -0.0047739 -0.0086295 0.0013819 -0.0094478 -0.7158089 0.0632325 -0.0125287 0.4125362 0.1461666 0.007997 -0.0150511 -0.0022464 -0.1535839 0.2716586 -0.0254833 0.0058745 0.0008965 0.3659932 -0.0015317 0.0055224 -0.0016538 0.0064804 1.7003662 0.1094471 0.0322966 0.1629425 0.0578538 0.0044167 0.0313193 0.0037659 0.1479911 -0.2802569 -0.0892558 -0.0007271 -0.3649639 -0.0399346 -0.0083295 0.0023255 -0.0030851 -0.2431014 -0.3644644 0.0503853 -0.0051189 0.0622148 0.0487302 -0.0001544 -0.0051072 -0.0002204 -0.1516518 0.0072421 -0.0499 -0.0019873 -0.0534011 -0.0539608 -0.0015631 -0.0023293 0.0004026 0.115577 0.5419535 -0.036885 0.0136107 0.0034578 0.2716198 -0.0014405 0.0135645 -0.0019743 -0.0708884 0.0466923 -0.1032196 0.0002652 -0.047762 -0.1127156 -0.0002307 -0.0003747 -0.0018417 0.0606077 0.2671489 -0.1346866 0.0092097 -0.0476746 0.3508681 -0.0032889 0.0088271 -0.0056904 -0.113291 -0.057086 0.1152035 -0.0048045 0.1050385 -0.04299 0.0027925 -0.0043223 0.0032615 0.1529924 0.0898339 -0.0728353 -0.000757 -0.0138018 -0.1305794 0.0011822 -0.0010304 0.0002316 0.1451369 0.0094181 0.1805828 0.0011076 0.0592068 0.0028693 -0.0001258 -0.0001621 0.0016506 0.1053249 -0.0173941 -0.0994495 0.1192938 -0.0353208 0.0113665 0.0053602 0.1112697 0.0732998 -0.0532576 -0.0153523 -0.0982859 -0.1202413 -0.0324046 0.0152745 -0.0034405 -0.1099793 -0.0737517 -0.056466 0.0832095 -0.0376547 -0.0005196 -0.0609152 -0.1134218 -0.0003246 -0.0003731 0.0000156 0.112924 0.0315856 -0.0742792 -0.1064197 -0.0178763 0.0223476 -0.0110017 -0.090063 -0.0691516 -0.0412269 0.0222649 -0.0762459 0.110253 -0.0171721 0.0235135 0.0093787 0.0932038 0.0649651 -0.032592 -0.0693698 0.1835556 -0.0051075 0.0541761 -0.0054792 0.0018861 -0.0042972 0.0048212 0.1066179 -0.028354 0.1288981 -0.0045007 0.1184147 -0.0476269 0.0036092 -0.0045384 0.0038416 0.1457777 0.2236538 -0.0013212 -0.002957 0.0454253 0.122827 0.0038703 -0.0006682 0.0032136 0.3536881 0.2472048 0.0031779 -0.0023391 -0.0090052 0.1227612 0.0020131 -0.0026745 0.0018231 0.3730815 unknown
polarizability: 195.678103|-3.1362942|153.8412695|2.8934013|-0.5067707|63.0146335 unknown
InChI: InChI=1S/C11H12N2/c1-7-5-11(12)8(2)9-3-4-13-6-10(7)9/h3-6H,12H2,1-2H3
charge 0 multiplicity 1
25 atoms
N  -3.432531 -0.321266 -0.072276
N  3.082711 0.010781 0.066815
C  0.280132 -0.74988 0.008293
C  0.695755 0.645375 0.011226
C  -1.112686 -1.098109 -0.021187
C  -0.300892 1.690558 -0.015142
C  -2.064257 -0.049598 -0.044707
C  -1.643699 1.326133 -0.041482
C  1.341973 -1.719584 0.036976
C  -1.613129 -2.53146 -0.028033
C  2.098161 0.936236 0.040705
C  0.093398 3.156852 -0.013205
C  2.676562 -1.312212 0.064479
H  -2.414608 2.107755 -0.060178
H  1.123936 -2.791394 0.038359
H  -0.794801 -3.265959 -0.026066
H  -2.239484 -2.748373 0.861865
H  -2.229022 -2.741261 -0.926657
H  2.435282 1.979408 0.043629
H  0.676912 3.421055 0.888756
H  0.718846 3.411858 -0.889307
H  -0.799308 3.804066 -0.037604
H  3.486489 -2.05002 0.08631
H  -3.781227 -1.27434 -0.066969
H  -4.107816 0.437181 -0.092498
