program: Gaussian 09
title: 000268978
version: EM64L-G09RevD.01
frameworkgroup: C1[X(C23H22N2O2)]
method: RPBEPBE
basis: SDD
operation: Freq
keyword: #p
keyword: freq=noraman
keyword: PBEPBE/SDD
title: #p freq=noraman PBEPBE/SDD
converged: YES YES NO NO
title: Mulliken charges:
elementType: O O N N C C C C C C C C C C C C C C C C C C C C C C C H H H H H H H H H H H H H H H H H H H H H H
charge: -0.269650 -0.273475 -0.038079 -0.038451 -0.731033 0.526157 0.526823 0.249094 0.240425 -0.515569 -0.596071 -0.091932 -0.087710 -0.452867 -0.358052 -0.333601 -0.338941 0.281982 0.285261 -0.458226 -0.459833 0.138068 0.139048 -0.791545 -0.791626 -0.529932 -0.530366 0.222943 0.235212 0.280911 0.269723 0.235373 0.245542 0.260313 0.260090 0.239702 0.239641 0.255266 0.225098 0.224201 0.224912 0.223954 0.255668 0.249198 0.226954 0.224984 0.226811 0.226065 0.247540
chargesum: 0.00000
title: Mulliken charges with hydrogens summed into heavy atoms:
elementType: O O N N C C C C C C C C C C C C C C C C C C C C C C C
charge: -0.269650 -0.273475 -0.038079 -0.038451 -0.272878 0.526157 0.526823 0.249094 0.240425 -0.234658 -0.326349 -0.091932 -0.087710 -0.217494 -0.112510 -0.073288 -0.078851 0.281982 0.285261 -0.218524 -0.220192 0.138068 0.139048 -0.086981 -0.087092 0.171205 0.170050
polarizability: 4.04238960e+02 -2.87685757e+01 2.65810683e+02 -2.12473364e+01 -2.80065419e+00 2.09125553e+02
1716.lowfreq: -4.7744 -3.0605 -0.0009 -0.0006 -0.0005 2.6429 7.5849 10.1352 24.8664
frequency: 6.9094 9.9061 24.8005 56.1752 67.3274 76.1080 85.7536 90.9970 92.9164 130.6773 155.8312 173.1111 175.8642 177.5559 179.5804 199.2265 207.3583 212.1473 230.7267 247.0019 248.8076 288.4768 317.6303 350.8653 352.9388 357.3659 369.4944 423.3524 433.5136 436.7821 463.7586 500.2310 507.0168 510.2964 514.4267 538.2936 547.4169 585.4558 588.5895 616.3675 622.2938 625.9264 631.4458 665.6989 677.1090 724.6914 738.7302 789.6857 792.1584 813.4854 823.7705 836.3365 846.0524 849.4995 853.3225 878.8880 896.7001 908.3182 927.1959 939.2538 945.8744 968.0829 977.4312 978.6420 981.2313 986.7658 1000.7520 1001.7654 1044.8897 1045.2251 1086.4172 1088.3052 1112.1233 1112.7893 1131.7372 1133.6443 1156.2390 1158.7268 1165.4139 1174.4426 1186.0969 1202.9071 1215.3754 1247.8362 1255.2728 1278.7114 1279.0659 1289.4797 1323.5505 1329.2014 1352.6171 1357.1153 1386.4937 1386.9196 1397.3587 1398.2034 1401.8577 1403.2225 1437.8539 1438.1202 1453.4317 1456.1600 1457.9344 1465.4420 1465.9364 1466.4950 1467.9016 1468.7861 1469.1598 1478.9507 1481.0055 1502.9480 1504.7355 1553.3963 1555.0414 1584.2612 1585.3318 1631.3246 1633.1851 2967.2467 2967.3573 2967.5726 2978.3022 2979.0015 3013.0722 3054.7430 3055.5523 3058.7353 3058.7963 3117.3510 3117.5263 3119.4069 3128.7821 3130.7799 3131.9934 3147.1059 3154.2158 3161.4884 3162.7164 3164.1690 3164.9004
redmass: 4.7471 4.7718 4.8496 1.2302 2.3605 2.2864 1.4042 3.3497 3.4539 4.9305 3.8104 1.9703 2.0660 4.0729 4.3280 3.3635 3.2995 3.4626 2.4046 1.7281 1.6159 3.9101 3.0104 3.7140 3.7300 4.6064 3.9437 5.1593 3.4690 3.5783 5.0823 4.6603 5.7060 7.2095 4.6703 2.9295 3.6038 4.9068 4.7438 5.0118 5.1831 5.1717 4.1778 3.4077 4.7492 4.7029 4.1574 2.8944 3.1248 3.9981 4.9317 1.5860 1.5038 1.5272 1.7984 3.5715 4.3808 1.6307 1.8243 3.3682 4.2511 1.9167 3.8554 3.5711 1.3978 1.4108 1.7278 1.7433 1.5714 1.5706 2.9787 3.1436 1.2603 1.2602 1.5513 1.4940 1.4711 1.4302 2.3280 1.8841 1.1644 1.7350 1.6922 1.6939 1.8535 2.4820 2.5956 2.2152 3.7133 3.7151 3.4557 2.8558 1.2839 1.2829 2.8016 2.7891 6.9740 6.8046 1.2784 1.2940 1.2890 1.2135 1.1820 1.0690 1.1068 1.2657 1.2387 1.0471 1.0470 1.7766 2.0664 3.3727 3.4521 6.6749 6.7064 7.0852 7.1130 6.9351 7.0326 1.0356 1.0427 1.0458 1.0383 1.0383 1.0999 1.0972 1.0972 1.1042 1.1042 1.0978 1.0977 1.0892 1.0889 1.1002 1.1001 1.0916 1.0916 1.0912 1.0914 1.0952 1.0958
irintensity: 0.4484 0.4987 0.2918 0.8133 0.5257 0.3744 0.4028 5.4652 5.4215 2.8131 3.6376 1.0751 1.2985 0.5115 0.2332 0.6496 1.3734 1.7780 0.1173 0.8589 0.9141 1.7413 0.8259 7.6759 3.3572 3.5723 8.0974 3.5230 1.6146 0.4308 0.8883 3.2073 1.4838 2.0418 1.7166 6.3896 3.8044 11.2616 7.2929 1.6003 5.3165 2.5380 1.7667 2.4896 7.5578 6.3323 4.6418 4.7772 0.2474 1.1292 6.2604 24.1329 1.8539 59.0056 53.8999 1.3485 1.6219 8.1273 1.7424 9.4052 21.3790 8.7235 34.1751 25.7507 1.0297 1.5787 8.2858 5.6243 5.3679 5.3196 71.1499 41.9185 0.1015 0.0998 7.5433 2.1441 1.1615 11.3459 108.7593 56.8007 3.2596 0.1469 5.2595 6.1492 7.3626 3.2140 4.6490 5.9532 46.1148 53.4184 27.6510 22.5052 23.3761 24.3188 89.0610 64.1892 1.3541 7.4202 22.3624 25.3370 13.4930 6.6927 23.5301 15.8339 13.3503 79.9749 29.3582 19.0305 18.9239 0.7549 1.9106 54.8260 73.3783 51.6316 70.6871 92.6873 203.7947 3.2801 1.1402 52.6998 78.6673 18.6685 35.3483 33.3151 10.5891 19.9479 19.4466 36.0445 45.2632 9.6176 10.1651 16.0372 10.1732 17.9716 15.7069 7.1863 4.9540 11.5615 13.7066 10.4482 8.5356
temp: 298.150 k
press: 1.00000 atm
elementType: 8 8 7 7 6 6 6 6 6 6 6 6 6 6 6 6 6 6 6 6 6 6 6 6 6 6 6 1 1 1 1 1 1 1 1 1 1 1 1 1 1 1 1 1 1 1 1 1 1
symmnumber: 1
zpe: 1026943.9 jmol-1
zpe.correction: 0.391142 hartree
zpe.thermalcorrener: 0.415941 hartree
zpe.thermalcorrenthalpy: 0.416885 hartree
zpe.thermalcorrgfe: 0.333394 hartree
zpe.sumelectzpe: -1147.701188 hartree
zpe.sumelectthermal: -1147.676389 hartree
zpe.sumelectthermalent: -1147.675445 hartree
zpe.sumelectthermalfe: -1147.758936 hartree
dipole: -2.5945 3.4107 3.5225
dipole: 5.5473
quadrupole: -140.5708 -138.3717 -155.7071
quadrupole: 9.5406 -16.7538 3.8524
quadrupole: 4.3124 6.5115 -10.8239 9.5406 -16.7538 3.8524
hfenergy: -1148.0923299 hartree
pointgroup: C01 [X(C23H22N2O2)]
dipole: 0.7542679 2.0046306 -0.4191393 debye
polarizability: 391.9077908|55.8007313|256.8488834|-11.4482282|24.7636114|230.4185215 unknown
InChI: InChI=1S/C23H22N2O2/c1-14-9-22(26-3)18-12-16(5-7-20(18)24-14)11-17-6-8-21-19(13-17)23(27-4)10-15(2)25-21/h5-10,12-13H,11H2,1-4H3
charge 0 multiplicity 1
49 atoms
O  -2.623757 1.90424 0.927493
O  4.000252 1.643454 -2.099934
N  -5.414071 -1.216168 0.16226
N  4.286481 0.039683 1.831458
C  0.048924 -1.701134 -1.705624
C  -1.372878 -1.547219 -1.161418
C  1.158928 -1.196621 -0.790291
C  -3.114694 -0.247279 -0.009307
C  3.154998 0.188212 -0.391498
C  -1.772396 -0.395869 -0.467458
C  2.093169 -0.254287 -1.238049
C  -4.086089 -1.288591 -0.254941
C  3.277447 -0.337531 0.94792
C  -2.338613 -2.579017 -1.399886
C  1.280683 -1.711303 0.544497
C  -3.659384 -2.45558 -0.96129
C  2.310432 -1.295864 1.389298
C  -3.58069 0.915415 0.708569
C  4.145087 1.152966 -0.802066
C  -4.913526 0.981989 1.126034
C  5.15646 1.528017 0.088523
C  -5.80241 -0.110883 0.830391
C  5.191629 0.943824 1.40294
C  -7.248477 -0.040256 1.27985
C  6.287406 1.344975 2.370716
C  -3.035338 3.105079 1.662826
C  4.981636 2.62621 -2.572206
H  0.219426 -2.773189 -1.931855
H  0.12031 -1.17136 -2.676811
H  -1.054716 0.404124 -0.260967
H  2.024717 0.158684 -2.249913
H  -2.027732 -3.483441 -1.937878
H  0.542094 -2.439578 0.899894
H  -4.402812 -3.238994 -1.137247
H  2.414752 -1.684248 2.407004
H  -5.305053 1.843511 1.673769
H  5.926593 2.25467 -0.184071
H  -7.775998 -0.951563 0.95958
H  -7.32267 0.04592 2.380671
H  -7.760848 0.839683 0.846579
H  7.288722 1.109736 1.962545
H  6.263673 2.432108 2.576016
H  6.154739 0.80189 3.318766
H  -2.13255 3.730037 1.717559
H  -3.377971 2.848152 2.683309
H  -3.837012 3.645624 1.124137
H  6.002768 2.19937 -2.573488
H  4.95997 3.540848 -1.949426
H  4.674985 2.866252 -3.600382
