program: Gaussian 09
title: 000268934
version: EM64L-G09RevD.01
frameworkgroup: C1[X(C13H10OS)]
method: RPBEPBE
basis: SDD
operation: Freq
keyword: #p
keyword: freq=noraman
keyword: PBEPBE/SDD
title: #p freq=noraman PBEPBE/SDD
converged: YES YES NO NO
title: Mulliken charges:
elementType: S O C C C C C C C C C C C C C H H H H H H H H H H
charge: 0.204316 -0.224834 -0.569607 0.444200 0.373970 -0.449210 -0.682460 0.409999 0.094601 -0.394178 -0.462338 -0.377738 -0.418422 -0.246118 -0.240421 0.254129 0.252891 0.278331 0.267914 0.282493 0.242758 0.249591 0.244702 0.232637 0.232795
chargesum: 0.00000
title: Mulliken charges with hydrogens summed into heavy atoms:
elementType: S O C C C C C C C C C C C C C
charge: 0.204316 -0.224834 -0.569607 0.444200 0.373970 0.057810 -0.136215 0.409999 0.094601 -0.111685 -0.219580 -0.128147 -0.173720 -0.013481 -0.007626
polarizability: 2.50869221e+02 -8.84801810e+00 1.77048545e+02 -1.89189769e+00 2.58925917e+00 6.94294201e+01
1716.lowfreq: -7.9826 -4.9554 0.0016 0.0017 0.0023 8.9426 58.6865 64.4379 110.7414
frequency: 58.6617 64.4365 110.7376 197.5550 202.6462 213.5281 270.9231 302.3055 355.0544 388.4733 399.0561 413.6031 470.3501 510.4759 520.9514 549.5520 561.0822 616.3419 627.2932 644.9222 682.8266 700.3389 762.5518 798.2924 809.5579 840.5261 847.8951 866.9885 890.9465 960.6284 963.7926 974.2987 993.2498 1006.0816 1025.1610 1036.1506 1095.2209 1135.2129 1137.7642 1160.0426 1177.5370 1190.6322 1233.7209 1259.7252 1281.3547 1294.5764 1318.2772 1330.2763 1398.8810 1407.8479 1423.6324 1426.9896 1445.6382 1446.8782 1502.3118 1554.7229 1573.6410 1603.5322 1626.3368 2981.1945 3030.5406 3062.5334 3108.3798 3125.7727 3133.9028 3135.9858 3149.1087 3163.8235 3166.4433
redmass: 4.1279 6.4634 4.6801 5.2647 2.7136 4.5219 3.6881 9.5268 6.3984 9.5148 4.0634 3.1544 3.4290 3.2952 6.1870 3.3319 4.6743 5.6489 4.6190 5.7679 6.1024 3.0313 1.3459 2.8910 4.9907 1.5905 1.7203 6.2194 1.7805 2.5093 1.7049 2.0492 1.3405 1.3700 2.5620 2.2224 2.8816 1.8007 1.1734 1.2458 1.1194 1.4055 1.9280 1.8549 1.8005 1.3760 2.0821 2.1246 5.1550 2.6151 3.5114 1.1712 1.0965 2.3186 3.4777 7.6739 9.7970 6.3527 6.6518 1.0633 1.0598 1.0955 1.1070 1.0863 1.0886 1.0880 1.0950 1.0960 1.1005
irintensity: 7.9559 0.0748 0.1852 3.2060 1.6624 3.6514 1.4639 0.7712 1.0704 6.5044 5.6466 6.9890 5.2396 4.5660 0.9073 9.1658 2.2355 1.4437 1.4891 2.6698 7.1121 2.6330 53.1303 3.1195 6.1402 59.6463 11.3948 2.8974 13.8648 8.9250 6.8629 9.3279 0.2368 0.6405 15.6464 21.7093 12.9994 2.1558 3.9896 3.4517 3.3150 50.7134 4.5862 32.9628 11.8056 36.7723 47.0970 116.0811 0.3238 6.5798 22.9733 12.7029 11.4987 38.3650 8.8072 8.6666 262.2550 3.8433 14.3411 9.6558 21.7363 16.8976 9.0841 1.0728 3.7412 7.6018 23.2690 9.0607 31.0507
temp: 298.150 k
press: 1.00000 atm
elementType: 16 8 6 6 6 6 6 6 6 6 6 6 6 6 6 1 1 1 1 1 1 1 1 1 1
symmnumber: 1
zpe: 500754.8 jmol-1
zpe.correction: 0.190727 hartree
zpe.thermalcorrener: 0.202441 hartree
zpe.thermalcorrenthalpy: 0.203385 hartree
zpe.thermalcorrgfe: 0.152541 hartree
zpe.sumelectzpe: -973.650739 hartree
zpe.sumelectthermal: -973.639026 hartree
zpe.sumelectthermalent: -973.638082 hartree
zpe.sumelectthermalfe: -973.688926 hartree
dipole: 1.6983 -2.1977 0.3578
dipole: 2.8004
quadrupole: -83.5997 -92.7259 -97.7598
quadrupole: 12.7731 -1.0516 -0.0793
quadrupole: 7.7621 -1.3641 -6.3980 12.7731 -1.0516 -0.0793
hfenergy: -973.8414666 hartree
pointgroup: C01 [X(C13H10O1S1)]
dipole: 0.7244039 0.819985 -0.1293279 debye
dipolederiv: -0.2380864 0.2178503 0.0298021 0.2808146 -0.4618251 0.067643 0.045382 -0.0510418 -0.0668842 -1.0016365 -0.2905627 0.0124999 -0.472299 -0.7887346 -0.0085548 0.0150096 -0.0118792 -0.3203069 0.5372155 -0.4312977 -0.0281032 -0.2939927 0.7775025 -0.0501112 -0.0259228 0.0268317 -0.0939854 -1.013361 -0.2718935 0.0241616 0.1619706 -0.3230611 -0.0018009 0.053983 -0.0682726 0.0029742 -0.264499 0.3230363 0.0056287 0.1945945 -0.2062615 0.0064797 -0.0214131 0.0432111 0.0302604 -0.1821233 0.1266007 0.0308505 0.1630192 -0.2083163 -0.0301744 -0.0113534 -0.056773 0.0555826 0.3433074 -0.0965724 0.0849634 -0.0053982 0.0159089 -0.0045404 0.1081464 0.0270812 0.1589477 0.2161108 0.2002319 0.006455 0.047422 0.0806696 -0.0004053 0.0257347 0.0078976 0.0625324 1.7355887 0.3491478 -0.0664958 0.132937 0.833693 0.0897449 -0.099121 0.0555972 0.1207734 0.1227861 0.1169654 0.0076035 -0.2521646 0.0265911 0.0140678 -0.0211588 0.0059629 -0.1144536 -0.2477695 -0.2172547 -0.0009754 -0.0341562 0.0344316 0.0155901 0.0055093 0.0089265 -0.1873375 0.0022277 -0.1393349 -0.0021412 0.0588905 -0.0152845 -0.0028753 0.0081531 -0.0050211 -0.1411205 -0.1541974 -0.1649526 -0.0027096 -0.1656817 0.0610493 0.0101736 -0.012105 0.0002074 -0.1699632 -0.1001541 0.1841925 0.0051293 0.1319677 0.0537264 0.0115398 0.0026657 0.0132281 -0.1594474 0.1271656 -0.063405 0.0047136 -0.0333236 0.0674976 0.0039907 0.0083275 0.0082277 -0.1429893 -0.1054142 0.0000038 -0.0386439 -0.0792345 0.0794583 0.0037851 -0.0505199 0.0237331 0.1031746 0.1295523 -0.0163365 -0.0326825 0.0461563 0.0419576 -0.0251672 0.0225601 0.0114203 -0.0713832 -0.0177597 0.0210421 -0.0150729 -0.0833106 0.0875579 -0.0683293 -0.0365477 0.0089194 -0.1053877 0.0018125 0.0815299 -0.0135922 0.0945753 -0.0658703 -0.0004047 -0.0009039 -0.010034 0.102822 0.0951559 -0.085674 -0.0069924 -0.0069325 0.0319612 -0.0048332 -0.0030536 -0.0035797 0.1529304 0.0253007 0.103963 0.0029588 0.0475473 -0.0670314 -0.0101559 -0.0006087 -0.0099441 0.1561471 0.0882017 0.0904308 0.0081345 0.0524527 -0.0239594 0.0011607 0.0011442 -0.004438 0.1523723 0.0466176 0.0268499 -0.0020015 0.1028254 -0.0821192 -0.0069973 -0.0017076 -0.0100437 0.1557859 -0.0062641 -0.0925075 -0.0067192 -0.1170404 -0.043145 -0.008734 -0.0056208 -0.0071069 0.1598014 -0.1397772 0.0279468 -0.0067712 0.0283607 0.0936036 -0.0010916 -0.0065795 -0.0031103 0.1591546 unknown
polarizability: 251.5713141|4.0287545|176.2275276|5.1943818|2.3952961|69.5483441 unknown
InChI: InChI=1S/C13H10OS/c14-12-7-8-15-13-10-4-2-1-3-9(10)5-6-11(12)13/h1-6H,7-8H2
charge 0 multiplicity 1
25 atoms
S  -1.029258 2.250428 0.027803
O  -3.392453 -1.638111 -0.021785
C  -0.378869 0.537957 -0.019711
C  -1.218069 -0.601672 -0.063053
C  1.061135 0.389901 -0.001526
C  -3.425836 0.773344 0.198345
C  -2.780038 1.91186 -0.594372
C  1.62914 -0.943351 -0.041685
C  -2.712769 -0.56739 0.015466
C  -0.618178 -1.910618 -0.128543
C  0.75603 -2.081267 -0.115505
C  1.955038 1.510749 0.050634
C  3.052228 -1.098332 -0.014423
C  3.340161 1.328915 0.079814
C  3.896311 0.013052 0.049862
H  -4.480512 0.632475 -0.099159
H  -3.419139 1.02448 1.279202
H  -2.716831 1.681908 -1.671474
H  -3.313496 2.865855 -0.455699
H  -1.305908 -2.761123 -0.168857
H  1.193794 -3.084966 -0.154821
H  1.545296 2.526293 0.059657
H  3.46974 -2.111507 -0.045271
H  4.004818 2.198402 0.120332
H  4.983565 -0.118684 0.071269
