program: Gaussian 09
title: 000268982
version: EM64L-G09RevD.01
frameworkgroup: C1[X(C18H17NO5S)]
method: RPBEPBE
basis: SDD
operation: Freq
keyword: #p
keyword: freq=noraman
keyword: PBEPBE/SDD
title: #p freq=noraman PBEPBE/SDD
converged: YES YES NO NO
title: Mulliken charges:
elementType: S O O O O O N C C C C C C C C C C C C C C C C C C H H H H H H H H H H H H H H H H H
charge: 1.008295 -0.318457 -0.545808 -0.262465 -0.506143 -0.498304 -0.414249 -0.741676 0.544268 0.223268 0.560870 0.284573 -0.541473 0.374522 -0.466990 -0.398018 -0.466439 -0.296365 -0.373309 0.450259 -0.454520 -0.314722 0.053376 -0.811018 -0.522576 0.235347 0.240919 0.255525 0.242513 0.234488 0.295308 0.251301 0.328265 0.252799 0.253584 0.238452 0.240830 0.241417 0.393693 0.231640 0.240078 0.256943
chargesum: 0.00000
title: Mulliken charges with hydrogens summed into heavy atoms:
elementType: S O O O O O N C C C C C C C C C C C C C C C C C C
charge: 1.008295 -0.318457 -0.152115 -0.262465 -0.506143 -0.498304 -0.085984 -0.265410 0.544268 0.223268 0.560870 0.284573 -0.285947 0.374522 -0.224477 -0.163530 -0.171131 -0.296365 -0.122008 0.450259 -0.201721 -0.061138 0.053376 -0.090319 0.206084
polarizability: 3.54188172e+02 -2.69525723e+00 2.29978372e+02 1.95178213e+01 -2.42179554e+00 1.88707917e+02
1716.lowfreq: -0.0018 -0.0017 -0.0010 2.5604 4.5965 6.5520 12.0096 16.6359 25.6228
frequency: 11.7104 16.5234 25.6205 49.0527 67.9320 78.7762 100.9611 115.6483 134.5901 151.9043 155.5119 166.6697 180.0536 202.7114 210.3619 210.8808 225.3093 230.7685 262.1658 281.2044 303.1723 317.6559 320.8316 337.0818 347.8722 360.4044 390.9769 416.3818 429.6808 440.2536 459.6366 483.8534 494.6471 515.0325 525.8714 538.9886 551.7168 563.1191 582.5622 600.8759 636.8278 662.0827 669.8213 708.1673 727.1153 733.9356 741.6639 766.7994 820.0226 820.1537 840.0535 848.0802 855.9381 875.3887 895.7634 913.0288 926.4862 931.8479 953.0108 958.5003 962.2377 973.1985 981.3926 1005.5798 1021.3981 1046.0576 1069.4848 1114.8930 1132.1714 1145.3766 1151.2057 1166.9846 1181.9445 1190.8856 1205.1077 1230.4218 1238.5641 1251.2695 1269.4572 1276.7495 1287.7552 1302.7546 1359.6454 1378.0818 1395.0739 1402.3120 1408.7591 1409.8389 1435.5844 1447.6404 1466.1857 1467.0331 1469.2230 1469.5958 1471.1561 1486.8354 1496.5537 1563.6910 1567.3084 1594.8347 1619.8608 1626.9350 1655.8257 2978.7894 2979.5362 2981.9543 3025.3144 3055.3463 3080.8840 3101.1131 3120.2903 3138.2298 3139.0942 3139.9880 3141.6120 3143.9223 3167.9601 3170.2193 3391.8824 3511.8426
redmass: 7.6310 4.2772 6.4646 8.1981 4.4386 5.8423 4.8074 6.4742 4.6428 3.5123 5.2818 1.6002 3.3391 3.4204 2.6964 2.2158 1.6631 4.7708 5.5563 5.6325 4.2037 8.2865 3.9836 5.0529 4.9391 3.0607 1.6763 3.2313 5.8574 4.0852 3.8854 5.1310 5.2608 3.7380 4.1318 4.3785 4.8866 8.2547 4.0428 3.4446 3.6916 3.7973 3.8092 4.1171 4.6345 1.8147 3.7684 3.5124 1.4520 2.0326 7.9798 2.7900 5.8289 1.4600 1.4902 1.8559 2.7859 3.0847 1.5132 1.4796 6.9147 1.6910 8.4133 1.9555 3.0362 1.5721 2.2523 1.2525 1.2806 1.3944 1.5009 1.3094 1.4220 1.4845 1.7612 2.4929 3.5125 1.6159 1.5069 2.2336 1.8823 2.2559 2.1140 3.4236 1.8781 1.7395 4.0769 3.8739 1.1945 3.3851 1.1936 1.0480 1.0618 1.1153 1.1008 2.2004 3.3025 6.4241 6.9048 5.3082 7.1500 6.6382 6.0123 1.0602 1.0384 1.0319 1.1005 1.0970 1.1052 1.0982 1.0874 1.0901 1.0920 1.0921 1.1007 1.0962 1.0945 1.0926 1.0651 1.0767
irintensity: 3.7139 0.6249 2.6392 1.6124 1.9535 1.4659 0.7044 6.8655 4.5179 1.1795 0.6381 0.1310 6.2987 3.0976 0.4831 0.5350 3.2411 1.2836 1.9344 5.2468 2.0494 7.9212 0.9641 12.5663 1.8685 3.1137 35.2237 5.4258 5.0868 165.3679 29.5879 21.7101 10.0705 4.8175 28.4794 19.6886 15.9723 94.9547 7.2723 0.5806 5.8523 20.9334 12.7898 6.7561 4.5985 41.7500 14.5535 1.3249 46.8432 52.5739 69.8052 21.5232 28.0184 16.5171 13.4537 5.9124 5.8753 15.4539 3.8154 6.3293 57.1311 2.1073 64.5489 3.1872 23.6030 5.5181 5.0073 0.3674 81.0372 68.8255 11.1524 16.1201 0.3252 2.4744 2.1506 30.9305 95.7231 16.6469 14.2238 16.3354 41.6467 15.8337 42.8360 16.5532 10.3727 21.0463 16.4791 14.3898 17.4088 16.0789 34.4991 21.1618 19.2008 20.0243 53.9585 81.6361 39.9027 17.6781 1.3365 114.8574 17.4193 31.1662 523.3171 25.3190 13.2563 45.2600 7.4595 13.3553 27.3351 20.0111 9.2633 3.1604 20.8441 12.6269 4.9817 9.1723 7.0320 2.6869 53.0231 36.4158
temp: 298.150 k
press: 1.00000 atm
elementType: 16 8 8 8 8 8 7 6 6 6 6 6 6 6 6 6 6 6 6 6 6 6 6 6 6 1 1 1 1 1 1 1 1 1 1 1 1 1 1 1 1 1
symmnumber: 1
zpe: 824277.9 jmol-1
zpe.correction: 0.313951 hartree
zpe.thermalcorrener: 0.337791 hartree
zpe.thermalcorrenthalpy: 0.338735 hartree
zpe.thermalcorrgfe: 0.258471 hartree
zpe.sumelectzpe: -1523.092254 hartree
zpe.sumelectthermal: -1523.068413 hartree
zpe.sumelectthermalent: -1523.067469 hartree
zpe.sumelectthermalfe: -1523.147733 hartree
dipole: 0.6061 3.2154 6.5142
dipole: 7.2898
quadrupole: -224.5709 -147.7279 -144.8217
quadrupole: 16.6986 -37.0885 -0.9258
quadrupole: -52.1974 24.6456 27.5518 16.6986 -37.0885 -0.9258
hfenergy: -1523.4062045 hartree
pointgroup: C01 [X(C18H17N1O5S1)]
dipole: 0.0069475 -2.2651431 1.7591622 debye
polarizability: 347.9364185|11.2934085|220.547056|-35.2492343|16.1494707|204.3909868 unknown
InChI: InChI=1S/C18H17NO5S/c1-11-7-18(20)19-15-5-3-12(9-14(11)15)8-13-4-6-16(24-2)17(10-13)25(21,22)23/h3-7,9-10,19,21H,8H2,1-2H3
charge 0 multiplicity 1
42 atoms
S  4.786045 1.006032 -1.446877
O  4.776574 -0.172774 1.310845
O  6.293483 -0.003522 -1.113741
O  -6.660709 0.704185 1.670603
O  4.587556 0.980753 -3.045498
O  4.88986 2.406909 -0.649698
N  -5.071731 -0.645672 0.623694
C  0.092856 -1.581441 -1.784017
C  -1.264785 -1.337886 -1.127513
C  -2.875095 0.192069 -0.030845
C  1.295596 -1.183923 -0.930158
C  -3.8242 -0.883056 0.044823
C  -1.608826 -0.068276 -0.62066
C  -3.258341 1.503929 0.499843
C  -2.225405 -2.383414 -1.038622
C  -3.488126 -2.165224 -0.462516
C  2.351141 -0.417711 -1.482638
C  3.456154 -0.091727 -0.686233
C  1.405174 -1.588997 0.424186
C  3.588992 -0.515383 0.654396
C  -4.510244 1.668394 1.061332
C  2.532764 -1.274577 1.212098
C  -5.502287 0.593062 1.160227
C  -2.285405 2.662494 0.425939
C  4.875611 -0.438069 2.754816
H  0.173193 -2.655572 -2.04371
H  0.145945 -1.033218 -2.744817
H  -0.87563 0.74344 -0.681157
H  -1.978002 -3.377764 -1.429386
H  -4.216664 -2.982403 -0.40291
H  2.325253 -0.077026 -2.524295
H  0.589135 -2.166441 0.873019
H  -5.756422 -1.406161 0.681471
H  -4.829754 2.632605 1.466979
H  2.586862 -1.623229 2.247489
H  -1.345622 2.436263 0.964173
H  -2.72105 3.572257 0.869194
H  -2.011948 2.890733 -0.621547
H  6.321849 -0.070281 -0.109391
H  4.874146 -1.52537 2.955633
H  4.049587 0.05614 3.297171
H  5.836572 -0.000643 3.059601
