program: Gaussian 09
title: 000268909
version: EM64L-G09RevD.01
frameworkgroup: C1[X(C10H14O2S)]
method: RPBEPBE
basis: SDD
operation: Freq
keyword: #p
keyword: freq=noraman
keyword: PBEPBE/SDD
title: #p freq=noraman PBEPBE/SDD
converged: NO YES NO NO
title: Mulliken charges:
elementType: S O O C C C C C C C C C C H H H H H H H H H H H H H H
charge: 0.268632 -0.279348 -0.255339 -0.370151 -0.344144 -0.249066 -0.687649 -0.285710 0.311637 -0.027046 -0.227770 -0.260358 -0.753768 0.207159 0.207101 0.197306 0.197389 0.223880 0.223729 0.211603 0.211583 0.218680 0.278550 0.254658 0.244684 0.239146 0.244610
chargesum: 0.00000
title: Mulliken charges with hydrogens summed into heavy atoms:
elementType: S O O C C C C C C C C C C
charge: 0.268632 -0.279348 -0.255339 0.044109 0.050552 0.198543 -0.045782 -0.285710 0.311637 -0.027046 0.050780 -0.005700 -0.025328
polarizability: 2.03496442e+02 8.89906717e+00 1.31357970e+02 -9.58776181e-02 7.99547670e-02 7.50126084e+01
1716.lowfreq: -40.2855 -0.0026 -0.0025 0.0010 3.6541 6.2045 19.0264 39.6235 52.4977
frequency: -29.1300 38.4611 52.4714 71.0829 92.4278 99.0098 106.7141 139.9882 166.3384 217.2984 235.4801 240.0445 275.7102 306.3553 377.4112 418.7902 461.0323 474.8957 564.3673 582.2348 630.3107 705.5355 712.8397 737.2892 757.3001 794.4413 822.8944 874.5195 909.6063 920.5367 929.4673 963.9696 1010.8454 1039.4427 1041.0399 1065.7467 1083.4550 1123.2423 1146.7475 1166.1798 1210.7264 1214.0430 1246.5030 1269.1268 1272.9828 1285.3838 1323.2582 1344.0881 1372.1745 1388.4729 1400.9039 1459.1505 1466.5924 1467.0230 1470.6319 1477.6521 1480.1255 1489.0640 1503.9364 1549.2045 1617.5882 2968.5078 2974.2217 2979.7707 2988.5825 2998.2324 3011.7803 3041.4869 3058.0318 3067.1111 3074.9903 3075.7791 3090.1410 3171.2195 3201.2114
redmass: 2.2049 2.6955 4.2504 3.7091 1.8590 1.3599 3.3444 4.2399 3.3676 4.9737 1.1190 4.6759 4.2842 3.8849 4.9624 3.2279 5.2141 8.0915 3.0455 4.7686 7.8216 8.2591 6.9950 1.0704 8.1572 1.1390 1.2431 5.2999 1.9701 1.4065 1.1663 1.8341 3.8562 1.4255 3.4347 1.5271 2.1767 2.6247 1.4782 4.0589 1.3477 1.7005 2.7173 1.1618 1.3974 1.0811 2.8984 1.4774 1.5896 1.2213 1.2239 1.0432 1.1537 1.0848 1.0703 1.0425 1.0702 1.0963 5.4500 5.1793 11.0944 1.0582 1.0367 1.0367 1.0596 1.0565 1.1003 1.1037 1.0979 1.1042 1.0994 1.1046 1.0987 1.0926 1.0986
irintensity: 0.6781 0.8551 0.9060 0.6090 1.0237 0.0927 0.5881 1.0082 2.0033 0.4535 0.0392 9.7854 4.5907 2.4838 3.2045 9.7354 10.0668 0.2723 0.3613 0.9254 2.5963 28.7758 0.4729 8.4629 0.4828 0.9913 44.8721 11.2208 10.8262 0.8485 0.6633 10.6678 237.0220 5.8021 76.1457 166.2236 0.2700 1.7380 2.0885 30.5909 0.0039 6.1240 312.7670 0.3374 41.5221 0.0900 7.0253 2.5659 4.3877 7.5450 9.2690 17.3029 24.7723 1.5899 0.0385 13.1121 11.0498 17.3169 131.0349 27.2961 255.9609 27.7880 32.1246 27.9150 14.1615 46.3546 6.0348 1.5728 14.5072 0.4887 51.1221 129.9133 13.1378 8.5920 0.5710
temp: 298.150 k
press: 1.00000 atm
elementType: 16 8 8 6 6 6 6 6 6 6 6 6 6 1 1 1 1 1 1 1 1 1 1 1 1 1 1
symmnumber: 1
zpe: 570410.7 jmol-1
zpe.correction: 0.217258 hartree
zpe.thermalcorrener: 0.231282 hartree
zpe.thermalcorrenthalpy: 0.232226 hartree
zpe.thermalcorrgfe: 0.174981 hartree
zpe.sumelectzpe: -936.972739 hartree
zpe.sumelectthermal: -936.958716 hartree
zpe.sumelectthermalent: -936.957771 hartree
zpe.sumelectthermalfe: -937.015016 hartree
dipole: -0.4923 -3.0223 -0.0033
dipole: 3.0621
quadrupole: -61.2775 -89.4895 -86.6028
quadrupole: 5.2064 -0.0197 0.0088
quadrupole: 17.8458 -10.3662 -7.4795 5.2064 -0.0197 0.0088
hfenergy: -937.1899971 hartree
pointgroup: C01 [X(C10H14O2S1)]
dipole: -0.2310895 -1.1823533 0.0024348 debye
polarizability: 203.9857885|6.6072845|130.8686565|-0.0370749|-0.0969143|75.0125756 unknown
InChI: InChI=1S/C10H14O2S/c1-3-4-7-12-10(11)9-6-5-8(2)13-9/h5-6H,3-4,7H2,1-2H3
charge 0 multiplicity 1
27 atoms
S  -2.857511 1.152827 -0.003199
O  1.041048 0.02193 -0.004423
O  0.105329 2.17093 -0.00828
C  3.417656 -0.485889 0.002496
C  4.868909 0.050697 0.001488
C  2.394524 0.650406 -0.006642
C  5.91547 -1.084188 0.013474
C  -1.318272 0.206343 -0.004027
C  -0.038123 0.920196 -0.006165
C  -3.808539 -0.382624 -0.000691
C  -1.567389 -1.163745 -0.002421
C  -2.96466 -1.491726 -0.00062
C  -5.310969 -0.343684 0.000665
H  3.255468 -1.129952 -0.883339
H  3.252331 -1.117993 0.896314
H  5.022105 0.7041 0.884298
H  5.026409 0.689609 -0.89109
H  2.482774 1.300491 0.884113
H  2.485299 1.288533 -0.905741
H  5.800775 -1.719679 0.91168
H  5.805254 -1.734792 -0.874446
H  6.944967 -0.682038 0.012618
H  -0.757773 -1.895818 -0.002638
H  -3.345379 -2.516336 0.000725
H  -5.709969 0.173128 -0.892026
H  -5.712469 -1.371455 0.005075
H  -5.708266 0.180128 0.890002
