program: Gaussian 09
title: 000268899
version: EM64L-G09RevD.01
frameworkgroup: C1[X(C7H7NO2S)]
method: RPBEPBE
basis: SDD
operation: Freq
keyword: #p
keyword: freq=noraman
keyword: PBEPBE/SDD
title: #p freq=noraman PBEPBE/SDD
converged: YES YES NO NO
title: Mulliken charges:
elementType: S O O N C C C C C C C H H H H H H H
charge: 0.210627 -0.234650 -0.206060 -0.357837 -0.057866 -0.202902 -0.080928 -0.216003 0.227260 -0.795008 -0.137307 0.317083 0.321601 0.285511 0.242926 0.274813 0.243039 0.165701
chargesum: 0.00000
title: Mulliken charges with hydrogens summed into heavy atoms:
elementType: S O O N C C C C C C C
charge: 0.210627 -0.234650 -0.206060 -0.036236 -0.057866 0.114180 -0.080928 0.069508 0.227260 -0.034230 0.028394
polarizability: 2.02216428e+02 1.12206244e+00 1.04140963e+02 1.08411260e-02 -3.27638929e-03 4.52183724e+01
1716.lowfreq: -54.8712 -2.4855 -1.6964 0.0016 0.0020 0.0021 11.1850 57.2677 70.1441
frequency: -54.7242 57.2524 70.1291 114.3575 136.3464 199.2668 214.3850 268.7313 313.4390 329.0789 409.3093 490.0657 521.1551 570.4293 572.1652 589.3040 608.5202 689.4196 767.4913 781.9536 849.2039 896.4472 935.3391 968.8415 980.6558 1016.7588 1032.6965 1130.5567 1178.6244 1212.7519 1245.6532 1352.3003 1380.5114 1386.4194 1442.9855 1467.9741 1484.5689 1494.7540 1553.3490 1579.4843 1641.3739 2888.3798 2990.4458 3075.3668 3138.7996 3187.9391 3225.0632 3526.9782
redmass: 1.0692 5.4096 5.6771 6.8997 4.9762 5.7183 2.7235 8.4979 4.4228 4.3470 8.7340 4.6321 5.6702 3.1962 7.7810 3.0454 1.2599 6.9288 5.7185 4.7737 1.2462 5.0842 1.3917 1.6573 1.7551 1.7328 1.6518 2.5072 2.3509 2.7470 1.7041 4.5041 1.2332 1.3914 1.1817 1.0462 1.6972 5.7444 5.3446 6.2752 5.7863 1.0846 1.0385 1.0983 1.0980 1.0937 1.0977 1.0773
irintensity: 0.0166 2.6964 6.8665 1.8277 2.1419 13.5473 16.5324 1.1583 0.5753 1.4094 7.8896 17.4245 2.4600 1.2234 19.5260 4.0892 99.2947 0.6297 48.8761 2.0168 57.8064 1.5616 2.6992 1.2853 64.5255 47.9897 9.0105 5.8187 2.3774 236.2744 0.5797 135.2001 65.7736 97.1887 148.0431 21.3197 558.5096 400.0946 27.2767 152.3893 140.3822 110.0265 5.5793 11.8227 5.6386 0.1277 5.3472 29.3080
temp: 298.150 k
press: 1.00000 atm
elementType: 16 8 8 7 6 6 6 6 6 6 6 1 1 1 1 1 1 1
symmnumber: 1
zpe: 334757.1 jmol-1
zpe.correction: 0.127502 hartree
zpe.thermalcorrener: 0.137820 hartree
zpe.thermalcorrenthalpy: 0.138764 hartree
zpe.thermalcorrgfe: 0.090675 hartree
zpe.sumelectzpe: -873.392042 hartree
zpe.sumelectthermal: -873.381724 hartree
zpe.sumelectthermalent: -873.380780 hartree
zpe.sumelectthermalfe: -873.428868 hartree
dipole: -5.1696 -4.3493 -0.0036
dipole: 6.7558
quadrupole: -82.3670 -68.8923 -73.0681
quadrupole: 5.4716 0.0029 -0.0061
quadrupole: -7.5912 5.8835 1.7077 5.4716 0.0029 -0.0061
hfenergy: -873.5195438 hartree
pointgroup: C01 [X(C7H7N1O2S1)]
dipole: 2.0224759 1.7244172 -0.026007 debye
dipolederiv: -0.0794016 -0.0744567 0.0008498 0.087904 -0.3312889 0.0075792 -0.0019168 0.0072515 0.1142415 -0.6431693 -0.0443087 0.0000121 0.7171388 -0.8655588 0.0108884 -0.0136925 0.0095203 -0.3254575 -1.4020817 -0.0969161 -0.0004765 -0.63318 -0.4635544 0.0009696 0.0084746 0.001977 -0.3336911 -2.2703645 0.1290559 -0.0068926 0.2936869 -0.4334343 0.0032185 -0.0097647 0.0026587 -0.2875242 1.3021912 0.0001791 0.0029371 0.7427094 0.4617312 -0.0067333 -0.0095739 -0.0082437 -0.0478679 -0.6445323 -0.1394077 0.0013138 -0.5572342 -0.2777477 0.0005904 0.0083146 0.0014296 -0.1737989 -1.1633292 0.3516761 -0.0078994 0.8851698 0.2045191 -0.0045214 -0.016626 -0.0055358 -0.1725387 0.5827126 0.0862472 -0.0001658 -0.2616526 -0.0686074 -0.000425 0.0057111 0.0001377 -0.0650256 2.0600759 -0.1060146 0.0064493 -1.1815769 1.1388162 -0.0191651 0.0258584 -0.016891 0.1845024 -0.3968846 -0.1364163 0.0012102 -0.2774327 -0.142212 0.0025212 0.0028306 0.0026892 0.0508709 2.1229938 -0.0363124 0.0045593 -0.0397397 0.6467554 -0.0089238 0.0045342 -0.0088427 0.1275937 0.1317998 0.036175 -0.000749 0.0360355 0.0903673 0.0021318 -0.0007618 0.0021948 0.216432 0.1654597 0.0341922 -0.00093 0.0286448 0.1402225 0.0031852 -0.0005531 0.0032135 0.3216796 0.0890762 -0.0342586 0.0003762 -0.0457642 0.0363329 0.0023613 0.0005447 0.0023929 0.1847163 0.0548883 -0.0002597 -0.0363733 -0.0284063 0.0454721 0.0994903 0.0136879 0.105657 -0.0249222 -0.0083561 0.0452541 -0.0010558 0.1097057 0.0345975 0.0019355 -0.0020984 0.0018333 0.1358918 0.0546001 0.0014478 0.0367122 -0.0283426 0.0386852 -0.1016225 -0.0122662 -0.1076367 -0.0178073 0.0443216 -0.0158766 0.0001225 0.1523343 -0.2550961 0.0065196 -0.0027027 0.0061943 0.1127051 unknown
polarizability: 202.1965056|1.7781133|104.143701|0.3048175|-0.9851874|45.2355562 unknown
InChI: InChI=1S/C7H7NO2S/c1-5(10)8-7-3-2-6(4-9)11-7/h2-4,8H,1H3
charge 0 multiplicity 1
18 atoms
S  -0.902517 1.526138 -0.026432
O  2.856879 -1.297258 0.030451
O  -4.448383 -0.436853 -0.000643
N  1.755627 0.770578 -0.008488
C  0.433018 0.308663 -0.003623
C  -0.049994 -1.005206 0.017061
C  -2.125674 0.167948 -0.006232
C  -1.475162 -1.069557 0.015421
C  2.913295 -0.038767 0.008124
C  4.21444 0.756377 -0.001855
C  -3.553253 0.460085 -0.013868
H  0.61949 -1.864056 0.032476
H  1.902227 1.782803 -0.025612
H  -2.046122 -2.000965 0.029734
H  4.294798 1.385389 -0.907678
H  5.056368 0.050014 0.011919
H  4.29046 1.415032 0.883037
H  -3.825097 1.544435 -0.032793
