program: Gaussian 09
title: 000268939
version: EM64L-G09RevD.01
frameworkgroup: C1[X(C14H15N3OS)]
method: RPBEPBE
basis: SDD
operation: Freq
keyword: #p
keyword: freq=noraman
keyword: PBEPBE/SDD
title: #p freq=noraman PBEPBE/SDD
converged: YES YES NO NO
title: Mulliken charges:
elementType: S O N N N C C C C C C C C C C C C C C H H H H H H H H H H H H H H H
charge: 0.216859 -0.264359 -0.345617 0.016240 0.023189 -0.302070 -0.450602 0.547707 -0.132736 -0.454978 -0.384758 -0.150221 -0.244529 -0.229565 -0.159618 -0.185354 0.246037 -0.770836 -0.861531 0.298779 0.215958 0.289039 0.289419 0.243959 0.224154 0.312208 0.243218 0.243685 0.258348 0.213022 0.253356 0.264281 0.271635 0.265679
chargesum: 0.00000
title: Mulliken charges with hydrogens summed into heavy atoms:
elementType: S O N N N C C C C C C C C C C C C C C
charge: 0.216859 -0.264359 -0.033408 0.016240 0.023189 -0.003290 0.054395 0.547707 0.156682 -0.211019 -0.160604 0.092997 -0.000844 -0.229565 -0.159618 -0.185354 0.246037 -0.046110 -0.059935
polarizability: 2.57029943e+02 1.32353511e+01 1.48407421e+02 -3.89705062e+00 -5.70045347e+00 1.53591089e+02
1716.lowfreq: -6.0023 -0.0017 -0.0017 -0.0013 3.6002 6.8473 21.8080 27.9816 31.8962
frequency: 21.7972 27.9338 31.8427 34.4312 52.7801 55.9536 62.5087 76.8229 111.2154 120.1455 126.2532 168.1996 175.8593 193.5395 220.8358 237.2071 286.4494 309.1196 331.0747 339.3547 366.3395 387.2045 406.7271 447.3060 468.2906 482.3334 513.0137 534.2391 566.0005 577.8764 602.2069 618.0406 630.7348 662.3459 678.4167 727.6495 775.7276 818.1752 835.5943 846.3237 895.4968 951.3894 966.2182 968.2961 969.8387 983.9987 988.5376 1003.9188 1007.2747 1013.2522 1041.8094 1061.7103 1079.6424 1109.9444 1129.2095 1195.8687 1201.2531 1214.4348 1233.0977 1260.8270 1269.3098 1294.1841 1308.0347 1329.8602 1351.0673 1372.4927 1384.8807 1389.1730 1409.2436 1446.7526 1449.6323 1454.5823 1461.6653 1466.5842 1485.7362 1490.2249 1572.2863 1610.0691 1618.3410 2203.3670 2208.2048 2974.6319 2996.9578 3008.8802 3009.0301 3040.1033 3078.9530 3097.7647 3101.5265 3107.7091 3127.0617 3129.9443 3136.9950 3143.4597 3164.3664 3565.9791
redmass: 4.9363 7.5854 4.5319 5.7595 4.7363 4.9889 2.0744 1.5261 6.8130 6.6776 6.6860 3.9571 4.4944 7.6215 1.1797 4.8012 2.8782 4.3679 4.3566 5.3598 8.0706 5.4693 2.8919 3.8290 6.4484 3.7145 3.1406 1.5104 12.0173 2.6420 3.1028 3.5419 7.0233 5.1330 6.3030 3.6987 3.7246 1.7002 1.2668 3.0426 4.9322 1.4045 1.4227 1.1849 2.3790 2.3305 1.3872 4.1041 3.3158 2.3680 1.6855 3.3895 3.2650 3.2382 1.4965 1.2301 1.1574 2.0309 1.3961 1.5885 1.8307 1.2394 1.2486 1.5567 1.1624 1.4719 2.0925 1.2632 2.7813 1.1466 1.0476 1.0521 1.0703 1.0891 2.1072 1.9004 6.4757 6.1841 6.1970 12.5645 12.5729 1.0805 1.0362 1.0606 1.0292 1.0847 1.1033 1.0992 1.0995 1.0879 1.1063 1.0896 1.1021 1.0951 1.0939 1.0786
irintensity: 0.9757 0.3600 2.7374 9.1647 2.3775 0.5020 6.0964 0.2207 1.3178 2.2589 8.7311 2.4971 3.3844 3.8284 0.0972 0.2257 6.0516 1.6852 0.4600 2.2379 0.0588 1.5362 0.0552 16.3885 8.6415 4.0108 29.8328 89.0386 0.5351 69.3732 0.0620 2.6932 0.0447 6.9874 3.3553 5.1758 5.3045 46.5744 0.6141 11.6816 3.8998 0.4721 0.5990 8.2863 2.8555 11.0264 12.1897 2.1997 8.8364 1.5668 20.7648 19.5873 47.7523 3.2303 7.9510 8.6766 0.8395 0.9963 3.4447 39.8268 80.7680 7.3369 4.3932 17.7954 1.8504 13.4160 3.6130 62.5698 9.1973 33.9460 20.1421 16.7818 41.5608 45.3402 100.6392 114.4401 1.4473 46.7352 147.6492 2.3850 4.1646 0.5631 9.1900 25.7892 19.6373 3.5161 7.0706 13.5440 12.9339 19.5538 16.0929 10.6224 5.0397 8.5510 6.2713 14.1165
temp: 298.150 k
press: 1.00000 atm
elementType: 16 8 7 7 7 6 6 6 6 6 6 6 6 6 6 6 6 6 6 1 1 1 1 1 1 1 1 1 1 1 1 1 1 1
symmnumber: 1
zpe: 684640.4 jmol-1
zpe.correction: 0.260766 hartree
zpe.thermalcorrener: 0.281214 hartree
zpe.thermalcorrenthalpy: 0.282158 hartree
zpe.thermalcorrgfe: 0.207848 hartree
zpe.sumelectzpe: -1178.618905 hartree
zpe.sumelectthermal: -1178.598457 hartree
zpe.sumelectthermalent: -1178.597513 hartree
zpe.sumelectthermalfe: -1178.671823 hartree
dipole: 5.9071 4.5215 3.0016
dipole: 8.0217
quadrupole: -141.9559 -126.8770 -114.2410
quadrupole: -1.4602 -16.5685 -6.6967
quadrupole: -14.2646 0.8143 13.4503 -1.4602 -16.5685 -6.6967
hfenergy: -1178.8796708 hartree
pointgroup: C01 [X(C14H15N3O1S1)]
dipole: 2.2868856 1.7036635 1.3519507 debye
polarizability: 257.4491663|12.2616135|148.5264434|1.246902|-5.2884753|153.0528431 unknown
InChI: InChI=1S/C14H15N3OS/c1-10(18)17-9-14(12(7-15)8-16)11-3-5-13(19-2)6-4-11/h3-6,12,14,17H,9H2,1-2H3
charge 0 multiplicity 1
34 atoms
S  5.022141 0.182982 0.881876
O  -2.903401 2.440779 -0.982032
N  -1.514838 2.11138 0.846191
N  -0.380825 -3.297329 -1.60005
N  -4.245026 -2.006364 0.067994
C  -1.115156 -0.21896 0.01272
C  -1.904387 0.70537 0.990786
C  0.396034 -0.122512 0.202645
C  -1.588961 -1.720141 0.188548
C  1.234694 0.253357 -0.871979
C  1.003958 -0.397622 1.457782
C  2.634453 0.357734 -0.712816
C  2.396976 -0.298593 1.629996
C  3.226943 0.082609 0.541856
C  -0.928035 -2.602697 -0.801388
C  -3.060558 -1.880523 0.108871
C  -2.048677 2.901122 -0.165182
C  -1.555251 4.342927 -0.211627
C  5.730431 0.639287 -0.7946
H  -1.381718 0.095159 -1.012458
H  -1.740297 0.398485 2.040438
H  -2.982381 0.630729 0.765118
H  -1.274745 -2.061435 1.197362
H  0.792146 0.463662 -1.852974
H  0.393249 -0.694267 2.320986
H  -0.759459 2.476579 1.426772
H  3.245145 0.647859 -1.572881
H  2.843833 -0.520808 2.605612
H  -2.413569 5.020292 -0.060465
H  -0.785203 4.570895 0.545503
H  -1.147189 4.554426 -1.214625
H  5.356674 1.621403 -1.123497
H  5.501168 -0.139547 -1.538237
H  6.819333 0.693262 -0.643243
