program: Gaussian 09
title: 000268912
version: EM64L-G09RevD.01
frameworkgroup: C1[X(C16H18O)]
method: RPBEPBE
basis: SDD
operation: Freq
keyword: #pfreq=noraman
keyword: PBEPBE/SDD
title: #p freq=noraman PBEPBE/SDD
converged: YES YES NO NO
title: Mulliken charges:
elementType: O C C C C C C C C C C C C C C C C H H H H H H H H H H H H H H H H H H
charge: -0.267949 -0.173456 -0.308805 -0.057975 -0.157460 -0.449383 -0.444276 -0.391297 -0.396578 0.337228 -0.216713 0.299705 -0.386444 -0.402294 -0.426720 -0.255059 -0.246853 0.254104 0.233851 0.214620 0.214927 0.205087 0.217418 0.220229 0.197573 0.188097 0.199365 0.213041 0.200751 0.229409 0.228379 0.238318 0.234123 0.226487 0.228552
chargesum: 0.00000
title: Mulliken charges with hydrogens summed into heavy atoms:
elementType: O C C C C C C C C C C C C C C C C
charge: -0.267949 0.080648 -0.074954 0.156645 0.057466 -0.026877 -0.026474 -0.003835 0.017213 0.337228 0.012695 0.299705 -0.158065 -0.163976 -0.192598 -0.028572 -0.018301
polarizability: 2.11967337e+02 -1.22831023e+01 1.73329995e+02 1.69180996e+01 -8.05923756e-01 1.14867511e+02
1716.lowfreq: -4.5564 0.0001 0.0008 0.0008 3.8284 16.9085 27.2372 62.9537 98.2162
frequency: 26.7833 62.9329 98.2026 137.5386 168.4887 219.8304 226.0819 271.1082 309.8160 329.1698 357.9102 407.5945 428.7621 443.4577 463.9999 491.7721 523.6732 559.6814 607.6176 612.8705 666.4258 685.4185 725.0625 728.1444 765.2606 775.8869 789.1172 801.8104 816.2134 845.5683 855.6497 870.1428 882.4578 892.2484 903.4230 938.2416 946.4896 954.2259 973.9056 981.8986 989.9624 1014.7348 1038.0065 1055.0228 1061.5798 1068.8907 1104.1745 1108.4562 1118.0215 1153.9847 1161.9593 1172.6243 1177.3311 1181.9614 1214.9419 1227.5571 1239.3865 1256.2032 1262.7792 1269.2447 1280.0621 1302.1098 1310.8899 1323.2506 1331.3697 1333.9046 1339.5344 1349.5105 1354.3043 1375.5562 1380.6261 1395.4590 1440.0215 1453.8180 1457.6563 1464.7781 1475.8847 1488.6512 1580.2465 1608.5537 1658.4949 2938.6521 2961.7168 2971.8975 2980.2291 2985.4707 2988.8613 3009.4274 3014.2493 3029.0822 3036.6153 3040.9601 3054.2756 3107.6319 3112.3205 3119.5711 3138.0127 3146.4085 3160.1701
redmass: 3.7206 4.0362 3.7356 3.5887 2.9554 3.4941 3.3798 3.0267 2.9438 2.5379 2.7479 3.6413 3.6570 3.3745 2.2989 5.3652 4.1431 3.3621 3.1340 4.6421 3.1543 3.7373 3.5051 2.3477 1.6730 2.3537 2.2308 3.6554 2.1136 3.2059 2.3831 2.3639 1.7976 2.1672 2.1308 2.6809 2.7759 1.5513 2.5551 1.3323 1.3314 2.5565 2.2785 1.8137 1.8964 1.8764 1.6442 1.5184 1.7352 1.8762 1.3086 1.0873 1.2285 1.3918 2.0847 1.7780 1.2615 1.3488 1.3749 1.2615 1.2462 1.2889 1.6887 1.3076 1.4235 1.6863 1.5094 1.5004 1.4473 1.4658 4.1548 2.0271 2.3339 1.0842 1.0887 1.0874 1.0893 2.7578 7.0211 6.2972 7.2002 1.0827 1.0629 1.0614 1.0642 1.0834 1.0632 1.0861 1.0897 1.0953 1.0988 1.0976 1.1030 1.0865 1.0870 1.0885 1.0928 1.0974 1.1004
irintensity: 0.9321 0.1336 0.1207 1.2990 1.3981 2.0716 1.2058 1.8892 5.4352 1.5260 1.2791 2.4731 0.8197 9.8590 2.9606 1.7557 5.3026 3.9562 5.0686 2.1026 2.1961 10.7557 5.8229 1.5063 35.8519 14.7730 3.8321 12.8811 22.7864 11.4405 14.7714 18.4847 1.4280 18.0472 5.8073 2.5810 45.8030 1.5381 16.8554 3.2958 1.1503 6.9638 7.8645 0.7222 10.3738 4.0499 3.7677 1.4683 5.9306 6.8723 7.3815 0.4259 1.3063 2.5168 1.0989 4.0348 0.1498 2.3973 3.0447 4.8140 1.6936 8.2601 4.3264 1.9272 1.3633 1.7297 0.0299 0.7185 3.4496 0.2984 1.1827 0.9477 5.7085 6.7832 9.6598 11.4140 12.8402 21.1774 1.9562 0.3917 0.9206 33.6717 38.4084 26.9884 37.2320 7.6362 42.5956 62.3547 5.3932 55.9738 53.9751 24.4076 68.1324 8.0521 13.7702 3.9367 26.8297 31.1064 33.8564
temp: 298.150 k
press: 1.00000 atm
elementType: 8 6 6 6 6 6 6 6 6 6 6 6 6 6 6 6 6 1 1 1 1 1 1 1 1 1 1 1 1 1 1 1 1 1 1
symmnumber: 1
zpe: 783087.1 jmol-1
zpe.correction: 0.298262 hartree
zpe.thermalcorrener: 0.311526 hartree
zpe.thermalcorrenthalpy: 0.312470 hartree
zpe.thermalcorrgfe: 0.258086 hartree
zpe.sumelectzpe: -694.478845 hartree
zpe.sumelectthermal: -694.465582 hartree
zpe.sumelectthermalent: -694.464637 hartree
zpe.sumelectthermalfe: -694.519021 hartree
dipole: 0.4668 -1.5233 -0.0329
dipole: 1.5936
quadrupole: -97.3364 -97.3206 -100.7736
quadrupole: 3.7350 2.8265 0.0353
quadrupole: 1.1404 1.1563 -2.2967 3.7350 2.8265 0.0353
hfenergy: -694.7771072 hartree
pointgroup: C01 [X(C16H18O1)]
dipole: 0.1817103 -0.5973407 -0.0569975 debye
polarizability: 211.9998399|-13.5781371|173.2182823|15.6517753|3.4303616|114.9467204 unknown
InChI: InChI=1S/C16H18O/c1-2-6-12-11(5-1)9-10-15-16(12)13-7-3-4-8-14(13)17-15/h1-2,5-6,9-10,13-16H,3-4,7-8H2
charge 0 multiplicity 1
35 atoms
O  -1.66999 1.586587 0.046609
C  -1.217912 -0.735627 -0.156025
C  -0.059085 -0.010276 -0.936689
C  -1.649952 0.344809 0.863618
C  -0.466363 1.507893 -0.855957
C  -2.377447 -1.133603 -1.103164
C  -3.026984 0.150371 1.515357
C  -3.672035 -1.477301 -0.332789
C  -4.125487 -0.26247 0.509499
C  1.333368 -0.367104 -0.410659
C  0.587243 2.449584 -0.319941
C  2.221159 0.625429 0.099904
C  1.801976 2.034395 0.134055
C  1.769345 -1.712412 -0.453389
C  3.508798 0.244261 0.565617
C  3.052819 -2.085594 0.00617
C  3.927435 -1.100734 0.522693
H  -0.840231 -1.632634 0.369012
H  -0.103134 -0.332553 -1.995255
H  -0.87252 0.448998 1.652493
H  -0.836932 1.8693 -1.8333
H  -2.057082 -1.985543 -1.735458
H  -2.592808 -0.28731 -1.785933
H  -3.30393 1.085608 2.037182
H  -2.923473 -0.63436 2.292617
H  -3.494669 -2.347859 0.333431
H  -4.468259 -1.772982 -1.042845
H  -4.338075 0.587703 -0.167271
H  -5.061375 -0.491737 1.054227
H  0.301404 3.50691 -0.273502
H  2.514754 2.763367 0.541766
H  1.099098 -2.480831 -0.859334
H  4.18134 1.01601 0.960323
H  3.369091 -3.133474 -0.042394
H  4.923711 -1.38052 0.882233
