program: Gaussian 09
title: 000268905
version: EM64L-G09RevD.01
frameworkgroup: C1[X(C11H14N2O2S)]
method: RPBEPBE
basis: SDD
operation: Freq
keyword: #p
keyword: freq=noraman
keyword: PBEPBE/SDD
title: #p freq=noraman PBEPBE/SDD
converged: YES YES NO NO
title: Mulliken charges:
elementType: S O O N N C C C C C C C C C C C H H H H H H H H H H H H H H
charge: 0.301255 -0.188358 -0.243230 -0.192858 -0.407122 -0.341679 -0.347909 -0.343457 0.695966 0.139684 0.211755 -0.337821 -0.239018 -0.809202 -0.692900 -0.548849 0.269066 0.224478 0.241834 0.212248 0.190121 0.196755 0.202635 0.349084 0.262042 0.279968 0.220471 0.210034 0.214961 0.270046
chargesum: 0.00000
title: Mulliken charges with hydrogens summed into heavy atoms:
elementType: S O O N N C C C C C C C C C C C
charge: 0.301255 -0.188358 -0.243230 -0.192858 -0.058039 -0.072613 0.118403 0.058912 0.695966 0.139684 0.211755 0.061569 0.023024 -0.529234 -0.047435 -0.278802
polarizability: 1.54050021e+02 1.93961783e+01 1.56476227e+02 6.91547311e+00 9.03550244e+00 1.28843238e+02
1716.lowfreq: -8.6014 -5.2968 -0.0019 -0.0017 -0.0015 11.3521 16.1910 31.4763 48.1874
frequency: 15.9517 31.4059 48.1005 52.9337 64.9229 83.8142 104.5759 149.5732 184.1156 218.9900 223.0799 246.9028 257.1535 285.1903 343.7139 397.1969 424.4771 442.1834 526.4253 579.7002 587.6246 612.2725 646.5967 657.8085 685.1138 696.0685 715.7459 728.6542 736.0396 774.7608 790.1131 796.7162 802.2262 845.0836 887.6717 898.3596 903.9913 926.3832 951.4106 1013.0831 1059.6735 1075.7891 1094.4450 1111.5221 1123.6634 1157.9577 1189.1852 1210.4570 1223.4836 1244.9690 1255.7415 1272.9187 1283.1164 1290.8280 1308.0101 1310.8288 1345.9864 1367.9629 1380.3813 1389.5391 1394.5743 1460.8006 1464.2295 1468.5746 1476.4423 1477.5514 1487.6846 1551.3962 1683.2099 1707.7845 2965.4131 2972.6312 2975.3853 2986.6110 2989.1416 3010.1237 3035.8982 3065.4435 3072.9759 3075.8709 3172.3076 3225.6429 3241.5647 3588.9025
redmass: 4.2904 3.9483 5.6093 2.0301 4.1130 5.3189 2.5146 5.0850 6.5078 1.2156 3.7876 3.1111 6.4919 4.6477 5.8506 5.7310 3.6275 4.1614 4.0869 4.9414 6.9422 5.4634 3.0228 1.6586 3.5852 1.2768 6.4494 5.6281 1.0958 1.6802 1.2856 3.4757 5.1923 3.6569 2.0357 1.7443 1.9573 1.3740 2.6683 4.0270 2.4169 2.4159 1.0951 2.6868 2.6944 1.3525 1.7716 1.5883 1.5744 1.7251 4.8228 1.3496 1.4597 1.0874 1.5729 1.6865 1.4691 1.3977 2.9276 1.2223 2.8786 1.0791 6.4079 1.0829 1.0507 1.0565 1.0867 6.2083 7.9102 12.0118 1.0590 1.0604 1.0370 1.0646 1.0829 1.0973 1.1004 1.1016 1.1011 1.0995 1.0927 1.0958 1.1000 1.0802
irintensity: 0.0208 0.2430 0.1722 0.0178 0.1318 0.2905 0.0536 2.9472 5.2110 0.0458 2.1363 0.5785 6.1417 7.6220 1.6006 14.7441 8.8924 0.7624 0.4142 7.2882 19.4613 16.4372 30.8742 88.7380 23.5073 2.7050 49.3588 2.1143 12.3778 67.5262 1.2342 15.1014 25.2022 1.2437 5.4495 11.2544 0.5414 9.5922 9.0439 12.8859 26.5711 0.9030 7.8033 43.1839 32.3454 8.0075 23.5467 42.7502 15.4661 14.4547 87.3697 3.4970 25.7048 1.4793 59.3502 45.0971 2.9578 2.5947 62.7224 8.1767 98.6959 14.7298 22.1583 2.5543 12.6327 5.5102 20.8007 7.2170 643.8738 222.8321 5.8230 29.1199 38.0315 46.3232 14.2583 3.5530 20.8847 1.0902 88.2860 49.0522 0.7312 1.0620 0.3470 73.9594
temp: 298.150 k
press: 1.00000 atm
elementType: 16 8 8 7 7 6 6 6 6 6 6 6 6 6 6 6 1 1 1 1 1 1 1 1 1 1 1 1 1 1
symmnumber: 1
zpe: 619562.4 jmol-1
zpe.correction: 0.235979 hartree
zpe.thermalcorrener: 0.252041 hartree
zpe.thermalcorrenthalpy: 0.252985 hartree
zpe.thermalcorrgfe: 0.189271 hartree
zpe.sumelectzpe: -1084.408853 hartree
zpe.sumelectthermal: -1084.392791 hartree
zpe.sumelectthermalent: -1084.391847 hartree
zpe.sumelectthermalfe: -1084.455561 hartree
dipole: 0.8935 -2.9795 0.2387
dipole: 3.1197
quadrupole: -108.7112 -105.5976 -102.4427
quadrupole: -2.0850 -11.5809 -0.1502
quadrupole: -3.1274 -0.0137 3.1411 -2.0850 -11.5809 -0.1502
hfenergy: -1084.6448315 hartree
pointgroup: C01 [X(C11H14N2O2S1)]
dipole: 0.5017135 -1.1195701 0.0366095 debye
polarizability: 148.5084422|17.5385494|160.0175199|7.5540751|12.618019|130.8435232 unknown
InChI: InChI=1S/C11H14N2O2S/c1-2-3-5-13-9(8-4-6-16-7-8)10(14)12-11(13)15/h4,6-7,9,12H,2-3,5H2,1H3
charge 0 multiplicity 1
30 atoms
S  -2.8481 -2.862689 -0.33346
O  -2.174516 2.046804 -1.633715
O  1.255179 2.71374 1.538477
N  0.590669 0.794923 0.289946
N  -0.576497 2.701115 -0.00287
C  -0.447647 0.459157 -0.708404
C  1.60418 -0.152076 0.774447
C  2.653945 -0.535068 -0.293877
C  -1.353312 -0.682643 -0.286753
C  -1.209906 1.813586 -0.872595
C  0.524309 2.117048 0.709902
C  3.70472 -1.520141 0.266243
C  -1.939128 -0.795289 1.034222
C  -1.73468 -1.710836 -1.133225
C  4.762095 -1.92346 -0.783583
C  -2.758241 -1.898788 1.179809
H  0.003775 0.220064 -1.691993
H  1.094608 -1.063132 1.14594
H  2.100531 0.33391 1.634021
H  3.155738 0.383392 -0.656448
H  2.152613 -0.998293 -1.168475
H  3.191733 -2.428329 0.643532
H  4.207615 -1.058712 1.140044
H  -0.838727 3.678926 0.122821
H  -1.750426 -0.079771 1.839056
H  -1.463718 -1.870397 -2.175957
H  5.502397 -2.625634 -0.359013
H  4.290953 -2.416284 -1.654842
H  5.311156 -1.037979 -1.154773
H  -3.321319 -2.228043 2.050821
