program: Gaussian 09
title: 000268894
version: EM64L-G09RevD.01
frameworkgroup: C1[X(C12H10O2S)]
method: RPBEPBE
basis: SDD
operation: Freq
keyword: #p
keyword: freq=noraman
keyword: PBEPBE/SDD
title: #p freq=noraman PBEPBE/SDD
converged: YES YES NO NO
title: Mulliken charges:
elementType: S O O C C C C C C C C C C C C H H H H H H H H H H
charge: 0.316381 -0.444387 -0.246456 -0.339918 0.561226 0.068430 0.453717 -0.447515 -0.372328 -0.214600 -0.230231 -0.222192 -0.703465 -0.240839 -0.562241 0.230717 0.237088 0.250551 0.271840 0.229393 0.228085 0.305573 0.230766 0.367698 0.272708
chargesum: 0.00000
title: Mulliken charges with hydrogens summed into heavy atoms:
elementType: S O O C C C C C C C C C C C C
charge: 0.316381 -0.076689 -0.246456 -0.109202 0.561226 0.068430 0.453717 -0.210426 -0.121777 0.057240 -0.000838 0.005893 -0.397892 -0.010073 -0.289534
polarizability: 1.70766278e+02 6.02246641e+00 1.48513917e+02 5.96970489e+00 1.60853588e+01 1.16181312e+02
1716.lowfreq: 0.0005 0.0012 0.0016 2.9324 6.1421 14.9050 32.8549 39.0546 50.7690
frequency: 32.8320 38.9184 50.7666 89.0169 137.0307 156.6390 189.0090 237.3715 294.7915 336.4746 369.6558 402.5736 430.5237 467.3538 479.4204 510.6439 572.8603 601.2242 611.6503 615.3112 684.9985 704.3982 705.0277 717.3925 769.8769 798.9090 806.0552 831.7076 849.0898 854.1613 885.4891 890.6476 927.3567 978.0823 985.8325 990.6268 997.9415 1026.2879 1042.4430 1082.3424 1100.8596 1173.2447 1177.8581 1188.0004 1190.8769 1210.3346 1244.4395 1282.5600 1337.1092 1367.0002 1368.9838 1387.0807 1443.3971 1455.1454 1481.1641 1527.9405 1565.0860 1595.7621 1610.3532 2981.9473 3110.9854 3124.9771 3135.8652 3147.6285 3164.8000 3195.5121 3237.7461 3244.2009 3373.0436
redmass: 4.8332 5.5573 4.4764 8.3056 6.1655 5.7765 6.2185 5.3304 6.4029 6.5861 5.8729 2.7969 3.9239 1.6195 6.1053 2.1289 4.2181 7.5608 4.0663 6.4944 3.7701 1.4530 1.4545 7.1480 2.1224 2.2933 2.8521 4.2011 2.9877 1.2488 2.3613 1.8387 1.5106 1.4099 4.0811 5.9524 1.3475 2.2084 2.4249 1.5957 1.1067 1.0688 1.4524 1.1996 2.3357 1.3003 1.9502 1.4100 1.2903 2.6180 1.5418 6.7579 2.1632 7.9160 2.2583 5.7674 8.9063 6.0778 6.0714 1.0831 1.0883 1.0861 1.0909 1.0959 1.1014 1.0916 1.0948 1.1017 1.0639
irintensity: 0.1801 0.0796 0.0859 0.8389 1.1120 0.8314 3.8687 6.8247 6.6531 9.0016 19.0599 0.5966 2.9834 60.4572 2.3304 53.6727 29.7312 7.8223 17.9141 1.1354 27.9963 45.3898 32.0601 12.1221 35.8628 53.0669 35.9873 36.1421 23.7483 0.0465 16.6406 14.8818 20.7675 1.2524 80.9603 1.7527 0.2062 7.6290 22.6734 10.2532 9.7832 1.0615 23.9826 3.0247 34.8152 19.4838 114.6595 24.4980 1.8426 32.2806 145.2415 0.6029 10.1360 69.1318 10.0543 67.8122 106.3906 0.7570 2.0831 35.8325 9.3210 0.8291 8.8798 31.2420 23.6798 2.2196 6.3837 0.8843 60.2785
temp: 298.150 k
press: 1.00000 atm
elementType: 16 8 8 6 6 6 6 6 6 6 6 6 6 6 6 1 1 1 1 1 1 1 1 1 1
symmnumber: 1
zpe: 487936.6 jmol-1
zpe.correction: 0.185845 hartree
zpe.thermalcorrener: 0.198955 hartree
zpe.thermalcorrenthalpy: 0.199899 hartree
zpe.thermalcorrgfe: 0.144324 hartree
zpe.sumelectzpe: -1010.698711 hartree
zpe.sumelectthermal: -1010.685602 hartree
zpe.sumelectthermalent: -1010.684657 hartree
zpe.sumelectthermalfe: -1010.740232 hartree
dipole: 1.4446 -4.0325 -0.1403
dipole: 4.2858
quadrupole: -92.2166 -97.2853 -89.7781
quadrupole: 5.7893 -3.4558 5.6907
quadrupole: 0.8767 -4.1919 3.3152 5.7893 -3.4558 5.6907
hfenergy: -1010.8845565 hartree
pointgroup: C01 [X(C12H10O2S1)]
dipole: 0.5106698 1.542783 -0.4495868 debye
dipolederiv: -0.2115189 -0.114068 0.1619298 -0.2685026 -0.1250557 0.0706504 0.1837379 0.0079864 0.0691502 -0.6113686 -0.1210111 -0.0461865 0.059106 -0.7289215 0.2541356 -0.0882625 0.2932757 -0.4559952 -0.5988147 -0.0122131 0.1202446 -0.2774814 -1.0415395 0.1054749 0.1812703 -0.2017654 -0.339928 0.1383484 0.1005938 0.2107199 0.2559807 0.5134194 -0.2894003 0.3045342 -0.1912661 0.238588 0.0054172 -0.014078 -0.0102592 -0.2339174 0.0100555 0.0361742 0.1732188 -0.023268 -0.0911749 1.1884142 0.1777838 -0.3918914 0.553764 1.0781878 -0.1136345 -0.6097808 0.1718163 0.3369742 -0.7156782 -0.4324781 0.2988654 -0.304538 -0.2533749 0.0932017 0.4664656 0.227782 -0.1887875 -0.1946554 -0.0034924 0.0852996 -0.0384857 -0.0872787 0.038259 0.0251881 0.0641142 0.0487191 -0.1956219 -0.0005834 -0.0273427 -0.0095072 -0.0122793 0.0654639 0.0140729 0.0499716 -0.0681449 -0.1476403 0.0252892 0.0314763 0.0336918 0.0363809 -0.0008953 0.0487916 0.0088398 -0.1464003 -0.0930314 -0.0690167 -0.0108892 -0.0773845 0.0482967 0.0895091 -0.0297807 0.1124359 -0.0410098 -0.0346822 -0.0252274 0.1133206 -0.0117971 -0.056826 0.0540726 0.0976337 0.0719486 0.0850852 0.377265 0.3318951 -0.2758474 0.277905 0.0500577 -0.0962955 -0.3670643 -0.1551963 -0.0769801 -0.0426326 -0.1053449 0.0827064 -0.0771933 -0.0417676 -0.0129168 0.0983589 -0.0348396 -0.0488464 -0.0222072 -0.1178154 -0.2354313 -0.1209578 -0.0296797 0.1448481 -0.2378566 0.1395018 -0.1148257 -0.0188726 -0.0497052 -0.0196939 -0.0954356 -0.0361862 -0.0719007 -0.1020919 -0.0615645 -0.0137277 0.0909676 -0.0044031 -0.113143 0.0060076 0.0941301 -0.0267502 -0.1068551 -0.045821 -0.0528388 0.1149472 0.0808829 0.0123635 0.0639534 -0.004733 -0.0767169 0.0251569 -0.057312 0.0727328 0.120372 0.058234 0.0970337 0.0427435 0.0989911 -0.0111564 0.0845516 -0.0458297 0.1084249 0.0924211 0.0764834 0.0045844 0.1051911 -0.0392522 -0.0992123 0.0068228 -0.0990762 0.0531756 0.0714039 0.0092888 -0.0906175 0.0090802 0.0873487 -0.0614501 -0.1172784 -0.0515481 -0.0592444 0.1371707 -0.0387014 0.0398367 -0.005844 0.0710367 -0.0281902 0.0471281 -0.0077234 0.1695161 0.0064989 0.1140645 -0.0827415 0.122313 0.0358093 0.0324697 -0.0899442 0.0351129 0.0699639 0.4296485 0.1343931 -0.0209301 0.0197719 0.3204229 -0.0615577 -0.0705745 -0.1626992 0.2803983 0.1138497 -0.0007705 0.0665929 -0.0284636 0.0127576 -0.0341823 0.0625578 -0.0448758 0.1651755 unknown
polarizability: 167.6694154|-6.4031889|154.4957829|-13.7748413|6.9773759|113.2963099 unknown
InChI: InChI=1S/C12H10O2S/c13-11(9-4-2-1-3-5-9)12(14)10-6-7-15-8-10/h1-8,11,13H
charge 0 multiplicity 1
25 atoms
S  3.934499 0.83185 -1.215517
O  -0.885314 -2.322802 1.696691
O  1.002549 -2.58268 -0.112509
C  -0.281161 -1.068667 1.269146
C  -1.318979 -0.150616 0.616115
C  0.890388 -1.384351 0.300041
C  1.834192 -0.321458 -0.101978
C  -1.755674 1.021576 1.277586
C  -1.887934 -0.493785 -0.63632
C  1.775169 1.078032 0.28791
C  -2.744851 1.847091 0.696395
C  -2.872271 0.331321 -1.220273
C  2.936995 -0.603717 -0.910812
C  -3.302502 1.505477 -0.556717
C  2.814064 1.831371 -0.217051
H  0.133003 -0.568014 2.168512
H  -1.34011 1.275944 2.261511
H  -1.56583 -1.408676 -1.147326
H  0.979319 1.505675 0.899369
H  -3.084305 2.747005 1.221296
H  -3.306932 0.060617 -2.189053
H  3.212581 -1.570336 -1.328884
H  -4.06974 2.14327 -1.009621
H  -0.48785 -3.035421 1.113817
H  3.018493 2.893292 -0.097027
