program: Gaussian 09
title: 000022938
version: EM64L-G09RevD.01
frameworkgroup: C1[X(C10H19NO)]
method: RPBEPBE
basis: SDD
operation: Freq
keyword: #p
keyword: freq=noraman
keyword: PBEPBE/SDD
title: #p freq=noraman PBEPBE/SDD
converged: YES YES NO NO
title: Mulliken charges:
elementType: O N C C C C C C C C C C H H H H H H H H H H H H H H H H H H H
charge: -0.242541 -0.129082 0.066393 -0.461006 -0.461147 -0.403516 -0.403684 -0.380053 -0.333204 -0.333337 -0.336214 -0.336050 0.168635 0.208072 0.200535 0.200615 0.208105 0.198529 0.190746 0.190733 0.198515 0.197720 0.190288 0.213716 0.184998 0.184989 0.213603 0.212166 0.189629 0.189652 0.212197
chargesum: 0.00000
title: Mulliken charges with hydrogens summed into heavy atoms:
elementType: O N C C C C C C C C C C
charge: -0.242541 -0.129082 0.235029 -0.052400 -0.052426 -0.014242 -0.014436 0.007955 0.065510 0.065254 0.065581 0.065798
polarizability: 1.35149187e+02 -4.04890183e-03 1.13302643e+02 -3.35011550e-01 -4.19666278e-03 9.21269218e+01
1716.lowfreq: -10.3309 -0.0007 -0.0007 -0.0004 13.3743 16.2799 24.7233 71.4474 140.4960
frequency: 16.4887 71.3263 140.4903 174.3702 213.3879 228.4492 272.3972 286.3255 342.0961 377.2304 391.5588 428.0744 442.3455 465.3152 467.8559 520.5199 611.9198 758.3504 783.0467 795.9269 827.1636 841.0030 851.8831 886.5770 894.2493 910.2816 926.7768 969.9872 1015.5393 1027.4216 1050.2967 1055.7887 1059.3279 1074.9584 1092.7180 1101.1754 1116.2155 1120.8170 1142.4239 1149.3482 1189.8624 1207.2973 1240.9616 1249.4038 1256.1260 1264.4308 1268.4169 1293.5830 1299.4523 1312.2980 1328.9240 1334.2185 1339.8308 1340.2420 1349.5120 1353.4655 1366.2141 1380.3423 1384.3130 1442.9789 1448.0126 1450.4352 1460.6335 1463.0966 1465.8392 1466.1937 1471.9076 1481.8049 2801.2291 2849.5401 2860.7994 2947.8007 2951.8090 2965.9124 2966.5220 2969.4890 2976.9502 2981.4268 3027.3902 3028.3896 3038.2830 3044.7675 3051.2910 3059.6232 3061.4279 3075.1791 3078.4719
redmass: 2.7160 3.5123 2.7033 3.8178 1.7759 1.7791 4.8013 2.3042 1.8172 3.5299 1.8531 3.1092 2.9894 2.8157 1.9234 2.5156 1.8301 2.6065 1.4523 3.3862 3.7755 1.6045 1.8821 1.8854 1.3481 2.6562 2.0949 2.5909 2.5076 2.2015 1.2366 1.9512 1.9538 1.6246 2.6301 2.1796 2.3926 3.0303 2.6820 2.3358 1.2158 1.3363 1.3250 1.3194 1.2760 1.2960 1.2081 1.1859 1.1805 1.3153 1.3673 1.3488 1.5600 1.4026 1.3079 1.4523 1.3644 1.3841 1.3802 1.0803 1.0793 1.0952 1.0992 1.0866 1.0870 1.0918 1.0831 1.0938 1.0800 1.0712 1.0697 1.0666 1.0667 1.0627 1.0619 1.0639 1.0617 1.0625 1.0979 1.0951 1.1011 1.0994 1.0996 1.0874 1.0902 1.0954 1.0970
irintensity: 0.0232 0.6267 2.6562 0.0449 0.1644 2.1313 3.1730 8.0931 4.4087 0.0034 0.0124 0.1536 2.7644 0.8732 0.0242 2.0263 5.9453 9.6477 0.0783 0.4220 28.5617 0.0974 17.6462 0.5258 12.3241 8.3788 1.5456 15.6796 19.6518 8.7544 0.3047 19.4629 2.0534 5.7178 36.6910 0.7149 0.0049 54.2092 8.0180 1.3341 0.3138 2.2515 0.6630 5.2415 10.2274 28.0676 3.6008 3.4805 2.1447 1.7206 3.7277 0.0035 9.3711 0.3031 6.9189 0.7032 1.9497 18.8430 3.5355 2.1185 0.3331 18.6637 0.5123 4.8871 4.5104 7.4955 22.6896 3.9933 60.6842 48.6222 135.2876 32.2157 115.3105 34.3237 43.1714 34.8986 14.0212 30.8432 67.2400 70.0559 34.2466 2.5019 126.0645 71.9137 0.2834 50.4165 33.3475
temp: 298.150 k
press: 1.00000 atm
elementType: 8 7 6 6 6 6 6 6 6 6 6 6 1 1 1 1 1 1 1 1 1 1 1 1 1 1 1 1 1 1 1
symmnumber: 1
zpe: 732997.0 jmol-1
zpe.correction: 0.279184 hartree
zpe.thermalcorrener: 0.290666 hartree
zpe.thermalcorrenthalpy: 0.291610 hartree
zpe.thermalcorrgfe: 0.241083 hartree
zpe.sumelectzpe: -521.425934 hartree
zpe.sumelectthermal: -521.414453 hartree
zpe.sumelectthermalent: -521.413509 hartree
zpe.sumelectthermalfe: -521.464036 hartree
dipole: 2.1477 0.0011 -0.0159
dipole: 2.1477
quadrupole: -85.3442 -69.6240 -75.6894
quadrupole: -0.0116 -2.1876 -0.0067
quadrupole: -8.4583 7.2618 1.1965 -0.0116 -2.1876 -0.0067
hfenergy: -521.7051183 hartree
pointgroup: C01 [X(C10H19N1O1)]
dipole: -0.8449391 -0.0004423 -0.0088606 debye
polarizability: 135.1467163|-0.0035941|113.3026414|0.4674646|0.0065857|92.1293937 unknown
InChI: InChI=1S/C10H19NO/c1-2-4-10(5-3-1)11-6-8-12-9-7-11/h10H,1-9H2
charge 0 multiplicity 1
31 atoms
O  3.661142 0.001403 -0.169336
N  0.737984 -0.001148 0.169592
C  -0.693506 -0.001233 -0.296608
C  -1.442973 -1.26579 0.200309
C  -1.441286 1.264844 0.198716
C  -2.93773 -1.264242 -0.202579
C  -2.935994 1.264825 -0.204324
C  -3.664808 0.001145 0.299941
C  1.487094 1.2106 -0.270299
C  1.488954 -1.211128 -0.272234
C  2.925026 1.194196 0.27278
C  2.92693 -1.193345 0.270714
H  -0.724537 -0.001757 -1.4218
H  -1.348385 -1.307112 1.304579
H  -0.976404 -2.182943 -0.203074
H  -0.973211 2.18083 -0.205685
H  -1.346793 1.307357 1.302951
H  -3.425114 -2.176233 0.19323
H  -3.019535 -1.31382 -1.30849
H  -3.01765 1.313001 -1.310311
H  -3.422124 2.178032 0.190216
H  -4.719278 0.001655 -0.038006
H  -3.67956 0.001918 1.409228
H  0.990918 2.11599 0.118149
H  1.517796 1.28572 -1.388023
H  1.519681 -1.284431 -1.390084
H  0.994417 -2.117957 0.114826
H  3.497919 2.055603 -0.109475
H  2.899187 1.226187 1.384098
H  2.901252 -1.227311 1.381975
H  3.501188 -2.053158 -0.113077
