program: Gaussian 09
title: 000268895
version: EM64L-G09RevD.01
frameworkgroup: C1[X(C11H7NO3S2)]
method: RPBEPBE
basis: SDD
operation: Freq
keyword: #p
keyword: freq=noraman
keyword: PBEPBE/SDD
title: #p freq=noraman PBEPBE/SDD
converged: YES YES NO NO
title: Mulliken charges:
elementType: S S O O O N C C C C C C C C C C C H H H H H H H
charge: 0.237177 0.263351 -0.190569 -0.209020 -0.198706 0.022640 -0.545666 -0.488881 0.148642 0.473199 -0.427433 -0.090418 -0.426094 -0.458492 -0.206124 0.379793 -0.364502 0.348147 0.324865 0.261494 0.261914 0.332163 0.257418 0.295104
chargesum: 0.00000
title: Mulliken charges with hydrogens summed into heavy atoms:
elementType: S S O O O N C C C C C C C C C C C
charge: 0.237177 0.263351 -0.190569 -0.209020 -0.198706 0.022640 -0.197520 -0.164016 0.148642 0.473199 -0.427433 0.171076 -0.164180 -0.126329 0.051295 0.379793 -0.069398
polarizability: 2.85811477e+02 6.88321728e+00 1.70857634e+02 -2.19361881e+00 7.33382174e-01 9.41352932e+01
1716.lowfreq: -14.9690 -8.3191 -3.4355 -0.0024 -0.0009 0.0013 20.6902 51.3214 67.6799
frequency: 20.2963 51.2797 67.6536 100.2213 135.5724 142.3293 167.9942 208.7437 257.6828 279.5243 299.8951 351.4008 378.6366 417.1879 428.5358 467.6677 491.0190 505.5629 510.7126 533.9818 594.2369 607.4634 643.9598 659.1694 690.1980 697.3586 719.8336 735.7886 744.3138 781.4052 810.2103 845.7367 862.0639 899.0698 968.6692 985.1785 994.3643 1027.2976 1048.0355 1089.6368 1096.5728 1106.4042 1132.0790 1150.3031 1175.2706 1208.7995 1235.2923 1258.0439 1266.6930 1280.8416 1285.8372 1365.8715 1393.8274 1405.7653 1443.9529 1553.5179 1564.3568 1570.6000 1600.8947 3027.2361 3067.8323 3152.2130 3173.4009 3175.7095 3186.2855 3212.2525
redmass: 10.6538 12.5432 8.7450 10.7131 10.0580 7.1183 7.8638 5.3151 9.5600 7.4060 8.4101 11.1438 7.7317 6.5819 3.8065 6.0469 5.0010 9.6790 7.3499 7.8043 3.3860 7.9658 7.9180 6.1687 4.8269 5.4065 3.9149 3.9687 2.4160 5.1975 5.1915 1.4189 6.3340 1.2956 2.7336 1.4749 1.3541 3.7751 2.7850 1.7102 2.8432 1.2592 1.5615 1.1442 1.2598 7.8710 1.7240 1.3987 1.8371 1.4981 2.1783 9.5343 8.2638 5.3992 2.5305 9.1383 6.8654 8.5059 7.3872 1.0839 1.0877 1.0903 1.0918 1.0888 1.0957 1.1034
irintensity: 1.0032 0.0993 2.2855 1.1661 0.4118 1.7935 0.1631 1.9843 1.1180 1.7146 3.3124 8.4734 1.6341 12.7878 2.2606 8.3678 7.7895 30.6954 4.1116 3.0287 4.8501 3.2188 3.2640 18.8108 0.7382 8.4114 23.4758 43.5062 52.2331 6.6575 6.4519 29.9860 17.8358 0.6544 27.9538 18.8991 0.3932 15.7367 52.7510 6.9302 35.1756 8.9031 8.2089 12.1890 5.6879 581.6825 51.8413 23.9864 20.2340 3.2251 23.0747 117.5612 13.3903 27.0166 17.8414 120.5230 16.5703 102.7774 144.6890 1.0673 4.8349 2.1524 12.1850 1.8239 2.8477 2.0989
temp: 298.150 k
press: 1.00000 atm
elementType: 16 16 8 8 8 7 6 6 6 6 6 6 6 6 6 6 6 1 1 1 1 1 1 1
symmnumber: 1
zpe: 414564.3 jmol-1
zpe.correction: 0.157899 hartree
zpe.thermalcorrener: 0.172108 hartree
zpe.thermalcorrenthalpy: 0.173052 hartree
zpe.thermalcorrgfe: 0.115007 hartree
zpe.sumelectzpe: -1498.619038 hartree
zpe.sumelectthermal: -1498.604830 hartree
zpe.sumelectthermalent: -1498.603885 hartree
zpe.sumelectthermalfe: -1498.661931 hartree
dipole: 6.6002 4.4222 -1.2074
dipole: 8.0359
quadrupole: -123.2082 -118.3808 -109.0983
quadrupole: -4.5636 -1.9601 -1.2477
quadrupole: -6.3124 -1.4850 7.7975 -4.5636 -1.9601 -1.2477
hfenergy: -1498.7769377 hartree
pointgroup: C01 [X(C11H7N1O3S2)]
dipole: -2.5606397 -1.7884672 -0.4899802 debye
dipolederiv: -0.9779413 -0.0940626 -0.0240771 -0.1125682 -0.0778896 -0.0234204 -0.1000827 0.0687256 0.0035358 -0.1787027 -0.2385873 -0.0864356 -0.0556496 -0.1481213 -0.1043544 0.0392928 -0.0996953 -0.0471126 -0.5182138 -0.0170923 0.014979 0.1446552 -0.9198888 0.1721034 -0.0337649 0.0920008 -0.3018486 -1.0390553 0.1303691 -0.0956059 0.2196542 -0.4867093 0.0675873 -0.1316176 0.0572343 -0.2535054 -0.6648631 -0.157788 -0.0114212 -0.4073012 -0.7642136 0.0644737 0.0202029 0.0771112 -0.2323999 2.155642 0.2212787 0.1434013 0.4581162 1.0784422 -0.1249542 0.1508537 -0.1244646 0.2221835 -0.2609045 -0.0288555 -0.0458871 -0.0337398 -0.1015744 -0.0023413 -0.2158084 0.1205232 0.1986389 0.6330381 -0.373653 0.0315918 -0.5087255 0.1175023 -0.0938581 0.2825368 -0.2166387 0.1416074 1.2380335 -0.266889 0.000927 -0.3130358 1.0594464 -0.2660913 0.1468441 -0.1744653 0.1196422 -0.8519956 0.2288099 -0.0918262 -0.1658195 -0.4909764 0.0628779 -0.0415122 0.1345151 -0.0122148 1.1273245 0.4041972 0.0445143 0.3585695 0.1670935 -0.0161492 -0.0022157 0.0249396 -0.0487235 -0.1574547 0.1148604 0.006686 0.0783772 -0.1828191 0.0791018 0.0038629 -0.1429322 -0.3392437 0.0071951 0.3077212 0.0789549 0.191993 0.2514169 0.2784417 -0.0134138 0.3239482 0.07438 0.5396118 -0.0603696 0.0556472 -0.0366609 -0.0470824 -0.0078133 0.0772503 -0.0073015 -0.025644 -0.8670551 -0.0605303 -0.0289865 0.0227883 0.1732084 -0.0280317 -0.1201324 -0.0930256 -0.1139866 -0.9349384 -0.1189799 -0.0623337 -0.2705682 -0.2629534 0.0206888 -0.0567976 0.0344955 0.0235271 0.2918117 0.0766463 0.0287896 0.4473575 0.1859237 -0.0072908 -0.0253648 -0.0395162 -0.0749718 0.0492944 -0.0119014 -0.0204053 0.0807395 0.0280029 0.0243461 0.0279834 0.0238729 -0.0057254 0.0253786 0.028876 0.0174542 0.1481357 0.0429117 -0.0015867 -0.0335878 0.0111362 -0.0547941 0.0494706 -0.0361818 0.0064533 -0.1298881 0.0555839 -0.0881118 0.0094827 -0.0818916 0.1279048 0.0123723 -0.0434797 0.0597384 -0.079996 0.1224227 -0.0434194 0.052006 -0.0364473 0.1303469 0.1575741 -0.0015495 -0.0047147 -0.0209505 0.1160087 0.0058527 -0.0143951 0.0070514 0.1578667 0.0849641 -0.0639345 0.0011965 -0.024772 -0.0242546 0.0203621 -0.0114754 0.0163911 0.1456352 0.0794135 0.0610956 -0.0186403 0.0092889 0.1085195 0.0115874 -0.0101473 0.0244332 0.1649017 unknown
polarizability: 285.4687085|8.9436079|171.1272307|4.0653002|-1.0641539|94.2084648 unknown
InChI: InChI=1S/C11H7NO3S2/c13-10-7-5-6(12(14)15)1-2-8(7)17-9-3-4-16-11(9)10/h1-5,9,11H
charge 0 multiplicity 1
24 atoms
S  -1.645789 -1.967785 -0.015987
S  -3.306199 1.108037 1.074852
O  -0.624694 2.445649 -0.576875
O  4.927033 -0.422299 0.433191
O  4.129878 1.669138 -0.020836
N  3.96529 0.40491 0.18013
C  -2.351261 0.785139 -0.577414
C  -2.718964 -0.648258 -0.974783
C  -0.888073 1.212618 -0.454089
C  0.194598 0.215854 -0.202593
C  -0.01852 -1.184979 -0.011004
C  -4.144657 -0.876657 -0.543098
C  -4.531893 -0.105365 0.51264
C  1.519474 0.724275 -0.144188
C  1.089162 -2.039296 0.253962
C  2.590487 -0.139564 0.117434
C  2.39082 -1.527734 0.325272
H  -2.832337 1.481155 -1.289988
H  -2.521378 -0.838646 -2.042269
H  -4.765768 -1.660083 -0.984227
H  -5.482164 -0.153531 1.047158
H  1.68389 1.795542 -0.293965
H  0.918489 -3.111395 0.394129
H  3.251374 -2.171124 0.525849
