program: Gaussian 09
title: 000268889
version: EM64L-G09RevD.01
frameworkgroup: C1[X(C8H10N4O2S2)]
method: RPBEPBE
basis: SDD
operation: Freq
keyword: #p
keyword: freq=noraman
keyword: PBEPBE/SDD
title: #p freq=noraman PBEPBE/SDD
converged: YES YES NO NO
title: Mulliken charges:
elementType: S S O O N N N N C C C C C C C C H H H H H H H H H H
charge: 0.227921 0.228116 -0.235704 -0.235758 -0.120670 -0.120874 -0.285566 -0.285563 -0.364412 -0.364483 0.316750 0.316992 -0.168219 -0.168304 -0.771716 -0.771828 0.274902 0.258401 0.258491 0.275215 0.296347 0.311250 0.296415 0.311166 0.260547 0.260586
chargesum: 0.00000
title: Mulliken charges with hydrogens summed into heavy atoms:
elementType: S S O O N N N N C C C C C C C C
charge: 0.227921 0.228116 -0.235704 -0.235758 -0.120670 -0.120874 -0.025018 -0.024977 0.168890 0.169222 0.316750 0.316992 -0.168219 -0.168304 -0.164119 -0.164247
polarizability: 1.68998725e+02 -9.58262759e-02 1.66336068e+02 -3.07255833e+01 -2.48764309e-02 1.07035293e+02
1716.lowfreq: -15.9068 -11.4588 -6.8277 -0.0021 -0.0018 -0.0008 24.7114 27.5397 42.0644
frequency: 24.6971 27.1032 42.0334 73.9710 86.1872 98.3240 103.3870 114.0325 169.3686 270.6737 289.7926 330.6778 355.7710 375.0481 407.0755 426.5611 449.2397 462.2744 493.4441 556.6439 557.8260 570.9903 575.2159 603.6161 608.2780 620.4776 623.8784 719.0141 728.8326 765.2828 767.0470 772.4524 816.8114 900.7246 901.3220 905.3189 940.3289 977.4124 1056.9778 1073.2634 1084.9723 1100.9750 1126.4542 1127.9538 1164.8783 1216.5737 1231.6346 1231.9416 1305.9834 1307.0999 1329.3457 1360.3273 1368.9409 1373.4908 1421.6106 1422.8145 1429.1591 1437.9146 1608.7790 1609.6594 1661.7110 1664.9453 3043.8320 3044.8304 3052.7553 3052.8703 3113.0229 3117.6164 3128.0793 3128.1352 3443.4022 3443.5709
redmass: 7.6825 9.1983 5.7940 6.2968 7.8567 3.2690 5.3768 4.4011 6.8722 5.0160 3.1069 3.9335 5.0399 3.5289 6.0391 6.2708 8.8215 6.6914 3.5265 3.7891 4.4440 5.6318 8.2860 7.3224 6.4317 3.8435 5.7499 5.0111 5.7831 1.2123 1.1611 2.8779 3.2198 1.6498 1.6422 2.5920 2.1916 3.1116 1.5167 4.4645 2.8857 2.2005 1.1512 1.1539 2.0458 2.9019 1.3183 1.3219 2.5170 3.0757 2.1876 1.4003 1.9896 1.4187 1.0893 1.1086 1.0836 1.1161 9.5287 9.6853 7.9890 7.7447 1.0580 1.0607 1.0566 1.0566 1.1052 1.1059 1.1073 1.1073 1.0786 1.0786
irintensity: 0.0447 1.6273 0.2630 9.9468 0.0019 13.6179 0.0502 0.5653 1.2498 1.1670 6.3912 2.7847 30.2066 10.9146 23.1216 37.4018 0.7615 4.6774 0.2414 2.0817 5.7174 9.1359 4.6422 2.3996 22.7084 28.6221 0.7657 1.3861 5.8296 12.7802 115.8237 3.1376 111.5582 1.6095 23.8257 48.7408 62.8816 32.3063 114.8802 5.1209 144.0131 79.2425 0.8039 1.2713 45.4299 3.2849 45.5718 7.9007 152.9102 155.7590 32.6223 65.1851 188.3725 17.6578 15.0867 11.7982 37.1998 27.5950 650.7354 320.2570 61.9837 6.4894 4.9030 7.9455 3.3374 7.2363 0.9919 0.0117 0.5207 0.1635 19.5691 23.9234
temp: 298.150 k
press: 1.00000 atm
elementType: 16 16 8 8 7 7 7 7 6 6 6 6 6 6 6 6 1 1 1 1 1 1 1 1 1 1
symmnumber: 1
zpe: 489252.6 jmol-1
zpe.correction: 0.186346 hartree
zpe.thermalcorrener: 0.201868 hartree
zpe.thermalcorrenthalpy: 0.202812 hartree
zpe.thermalcorrgfe: 0.140867 hartree
zpe.sumelectzpe: -1475.256556 hartree
zpe.sumelectthermal: -1475.241034 hartree
zpe.sumelectthermalent: -1475.240090 hartree
zpe.sumelectthermalfe: -1475.302035 hartree
dipole: -0.0084 -0.5160 -0.0105
dipole: 0.5162
quadrupole: -100.0076 -104.4589 -112.5679
quadrupole: 0.0042 2.6277 0.0236
quadrupole: 5.6705 1.2192 -6.8897 0.0042 2.6277 0.0236
hfenergy: -1475.4429021 hartree
pointgroup: C01[X(C8H10N4O2S2)]
dipole: 0.0009623 -0.202972 0.0067099 debye
dipolederiv: -0.2199011 -0.2290407 -0.0310044 -0.2027689 -0.4882155 -0.1176454 -0.00651 -0.091725 -0.0709231 -0.2099399 0.2209799 -0.034111 0.1957158 -0.492826 0.1294099 -0.0093674 0.1027312 -0.0761887 -0.9375045 0.2793085 0.3697497 0.0484208 -0.4976883 -0.1486146 0.2229655 -0.2458387 -0.5939057 -0.949472 -0.2601765 0.3779702 -0.0330232 -0.4804865 0.1369608 0.2277815 0.2366589 -0.5998367 -1.0309809 0.1079166 0.3032178 0.1381243 -0.9809915 -0.4661752 0.3816627 -0.3379304 -0.5376256 -1.0401177 -0.1007236 0.3152045 -0.1290957 -0.9549593 0.4677709 0.3918861 0.3386351 -0.5536398 -0.4227155 0.0543568 -0.0280047 0.2846327 -1.1597006 -0.4213408 0.0840595 -0.3319071 -0.55417 -0.4314793 -0.0735683 -0.0153728 -0.3014966 -1.1323989 0.4350218 0.1007804 0.3440194 -0.5728066 0.3691998 0.1749494 0.095204 0.3066564 0.2520275 -0.0180241 0.0780666 -0.0228489 0.1352524 0.3565325 -0.1748149 0.100097 -0.3082813 0.2637631 0.0118682 0.0868902 0.0165335 0.1351691 0.9319405 -0.2026918 -0.4395777 -0.097175 1.0544077 0.4846722 -0.3302696 0.443361 0.5697932 0.9449099 0.1958701 -0.4539791 0.0941414 1.0238841 -0.4844228 -0.3424606 -0.4455819 0.5878244 1.1657003 0.0427501 -0.3981842 0.0656972 1.3377251 0.4805677 -0.4809817 0.5057789 0.4617192 1.1668671 -0.0462906 -0.4066667 -0.0714795 1.3160603 -0.4921609 -0.4896295 -0.5153457 0.4822403 -0.0671762 -0.2563127 -0.0035042 -0.3865619 -0.0742854 0.100934 0.003086 0.0855524 0.1698943 -0.0525088 0.2559581 -0.0135458 0.3862164 -0.0938846 -0.0928248 -0.0099763 -0.0775918 0.1744019 0.041134 -0.0642817 0.0475483 -0.008725 0.086041 -0.0633369 0.0310313 -0.0201493 0.0127264 0.0254639 0.0768293 -0.0427842 0.0047026 -0.0124381 0.0178998 -0.0669613 -0.015952 0.1066947 0.0247205 -0.0789769 -0.0408993 -0.0071656 -0.0096141 -0.0133967 -0.0664922 0.0208758 0.1066614 0.0434654 0.0669468 0.0475371 0.0109967 0.0861922 0.0601913 0.0308757 0.0176809 0.0102076 0.0440403 0.0231171 0.0122068 0.0141809 0.0833022 -0.0508097 -0.017897 -0.0856529 -0.0124893 0.0563162 0.1091593 0.0109306 0.0684891 0.0311132 0.0125521 0.0308628 0.0271218 0.0581286 0.0432378 -0.022189 0.0141923 -0.013775 0.0875826 0.0478084 -0.0152072 0.0832941 -0.0160221 0.0519254 -0.1092067 0.0133622 -0.0678643 0.034051 -0.012426 0.0319042 -0.0275848 0.0592657 0.0467773 -0.0092031 0.1018283 -0.1248609 0.3640047 0.0856093 0.0695718 0.046642 0.2567288 0.0495652 0.0193344 0.0985852 0.1342985 0.3573341 -0.0900885 0.0643287 -0.0507767 0.2608997 unknown
polarizability: 170.1029125|-0.3139524|166.3340144|-29.5686647|-0.3903029|105.9331593 unknown
InChI: InChI=1S/C8H10N4O2S2/c9-7-11(5(13)3-15-7)1-2-12-6(14)4-16-8(12)10/h9-10H,1-4H2
charge 0 multiplicity 1
26 atoms
S  -3.7698 -0.797078 0.127202
S  3.751927 -0.887806 -0.100759
O  -0.258634 -1.14675 -1.737999
O  0.225962 -1.108024 1.75666
N  -1.487491 0.461659 -0.541822
N  1.498025 0.441227 0.527888
N  -2.889199 1.847882 0.762842
N  2.937616 1.761066 -0.804166
C  -0.45474 1.518211 -0.632817
C  0.490782 1.52428 0.588344
C  -1.287975 -0.807079 -1.095795
C  1.266016 -0.808375 1.111783
C  -2.674882 0.709514 0.186236
C  2.693869 0.642574 -0.200968
C  -2.45433 -1.755114 -0.823273
C  2.411087 -1.789938 0.868882
H  0.118379 1.355673 -1.560301
H  -0.98006 2.485755 -0.678442
H  1.039467 2.479649 0.60626
H  -0.085904 1.402681 1.519885
H  -2.870137 -2.126902 -1.771843
H  -2.100083 -2.598039 -0.209933
H  2.814806 -2.14611 1.828613
H  2.039741 -2.640487 0.27656
H  -3.786666 1.936863 1.265621
H  3.83882 1.816468 -1.305057
