program: Gaussian 09
title: 000022923
version: EM64L-G09RevD.01
frameworkgroup: C1[X(C10H18O3)]
method: RPBEPBE
basis: SDD
operation: Freq
keyword: #pfreq=noraman
keyword: PBEPBE/SDD
title: #p freq=noraman PBEPBE/SDD
converged: NO YES NO NO
title: Mulliken charges:
elementType: O O O C C C C C C C C C C H H H H H H H H H H H H H H H H H H
charge: -0.269812 -0.269979 -0.433552 0.349575 0.006608 -0.482114 -0.500016 -0.403897 -0.413454 -0.742676 -0.376045 -0.369223 -0.070218 0.191302 0.229267 0.199309 0.224126 0.218117 0.208801 0.193809 0.197119 0.218820 0.211152 0.212187 0.214882 0.187096 0.253272 0.254000 0.185250 0.219952 0.356341
chargesum: 0.00000
title: Mulliken charges with hydrogens summed into heavy atoms:
elementType: O O O C C C C C C C C C C
charge: -0.269812 -0.269979 -0.077210 0.349575 0.197910 -0.053538 -0.057774 -0.001288 0.002485 -0.104454 0.064323 0.070027 0.149734
polarizability: 1.34571571e+02 -2.85529879e+00 1.03886429e+02 1.52242811e+00 -4.87979388e-01 9.83620316e+01
1716.lowfreq: -33.9758 -14.6916 -0.0009 -0.0006 -0.0004 4.7497 59.3266 90.6108 136.7898
frequency: 59.2748 90.5349 136.7025 169.9600 181.7813 213.7249 235.1279 253.6612 292.6073 305.2596 371.8662 392.7933 398.5167 419.7742 433.8592 465.7972 475.2741 506.4026 515.2303 588.5715 670.1428 763.1125 773.6360 786.2204 795.4640 833.1251 878.7064 899.4127 912.8936 926.9672 934.4848 941.9435 962.1802 978.4901 1013.8164 1027.5566 1046.4682 1078.6367 1086.7463 1093.0505 1107.2441 1147.3205 1152.9357 1191.6589 1206.2987 1210.8343 1249.4754 1258.0392 1272.4514 1285.4898 1295.1290 1300.3776 1304.3165 1324.2719 1338.7908 1341.7437 1350.3091 1362.0510 1366.5949 1372.1337 1389.1248 1443.8003 1452.6985 1454.2637 1458.6296 1468.8464 1473.6815 1475.8254 1478.7166 2941.0778 2964.2681 2967.0800 2970.3385 2975.9387 2985.0369 2994.6004 3006.1028 3033.2097 3043.1316 3049.6214 3051.6679 3062.6062 3066.8682 3073.7830 3095.1181 3097.8484 3534.9176
redmass: 3.6554 4.7554 2.5908 3.6718 2.7576 1.0933 3.0289 3.0254 2.2354 3.3588 1.6228 2.1108 1.8674 1.8233 1.8832 3.1445 3.9400 4.8836 3.5035 2.9660 4.4927 2.6924 1.5270 4.2977 3.8705 2.2686 2.5482 1.8367 2.2444 2.3985 1.4887 3.0653 1.4373 3.1069 1.8875 2.6120 2.2416 1.8578 1.3838 2.6171 2.0588 1.6623 2.3477 1.5121 1.3333 1.1427 1.4193 1.3167 1.6667 1.8811 1.4231 1.3780 1.2751 1.5150 1.5551 1.5203 1.3160 1.4560 1.3907 1.1826 1.2182 1.0847 1.0807 1.0899 1.0897 1.0836 1.0832 1.0540 1.0575 1.0826 1.0673 1.0366 1.0671 1.0591 1.0597 1.0621 1.0631 1.1001 1.1004 1.0902 1.0974 1.0991 1.0992 1.1017 1.0954 1.0974 1.0650
irintensity: 0.0201 0.8451 0.8860 3.6705 3.5137 0.2717 10.6141 4.5656 0.8806 11.0946 20.1327 6.7858 1.1298 43.8041 28.7805 7.5563 14.1093 5.6508 2.3241 11.1154 5.3086 11.5188 2.1996 6.9360 21.0145 44.5572 13.8800 2.7425 4.2587 7.6955 6.9228 35.6685 14.0436 4.9686 62.3486 69.7993 111.3689 10.9039 7.9030 8.6589 50.4952 5.5478 10.5236 13.2078 30.6177 4.3940 15.5930 4.8054 7.1060 0.4849 1.8182 0.4460 7.6221 6.5559 4.1394 0.9052 0.2832 10.7972 22.8617 38.3506 9.5994 10.9581 7.0817 15.1372 6.7578 9.1260 11.3983 12.0357 8.2716 21.9077 22.5803 28.9614 75.2422 33.8054 53.1657 29.6936 13.4373 40.9853 20.9695 15.5906 66.3066 64.5770 45.9403 42.9741 17.7026 19.6918 5.8016
temp: 298.150 k
press: 1.00000 atm
elementType: 8 8 8 6 6 6 6 6 6 6 6 6 6 1 1 1 1 1 1 1 1 1 1 1 1 1 1 1 1 1 1
symmnumber: 1
zpe: 707926.3 jmol-1
zpe.correction: 0.269635 hartree
zpe.thermalcorrener: 0.282317 hartree
zpe.thermalcorrenthalpy: 0.283261 hartree
zpe.thermalcorrgfe: 0.231735 hartree
zpe.sumelectzpe: -616.461816 hartree
zpe.sumelectthermal: -616.449134 hartree
zpe.sumelectthermalent: -616.448190 hartree
zpe.sumelectthermalfe: -616.499716 hartree
dipole: -1.6547 -2.3016 1.0840
dipole: 3.0349
quadrupole: -86.0856 -75.9706 -81.7530
quadrupole: -6.7244 2.3037 -0.9907
quadrupole: -4.8159 5.2991 -0.4833 -6.7244 2.3037 -0.9907
hfenergy: -616.731451 hartree
pointgroup: C01 [X(C10H18O3)]
dipole: 0.6493705 0.7510583 0.6632674 debye
polarizability: 134.5776389|-2.1030969|103.1475335|-2.4414368|1.9093796|99.0948589 unknown
InChI: InChI=1S/C10H18O3/c1-8-2-4-10(5-3-8)12-6-9(11)7-13-10/h8-9,11H,2-7H2,1H3
charge 0 multiplicity 1
31 atoms
O  -1.289897 -1.015377 0.924553
O  -0.573392 0.282695 -0.990623
O  -3.496366 -0.382168 -1.006583
C  -0.131109 -0.375419 0.262675
C  2.852842 -0.039941 0.163388
C  0.597591 0.612841 1.204152
C  0.784146 -1.52491 -0.171881
C  1.913377 1.123388 0.570523
C  2.103096 -1.007293 -0.788689
C  4.155905 0.484981 -0.475216
C  -2.40393 -0.081007 1.199196
C  -1.658044 1.267432 -0.791941
C  -2.865703 0.592507 -0.109744
H  3.114917 -0.603576 1.086592
H  0.81421 0.06577 2.142315
H  -0.049715 1.468063 1.473038
H  0.22812 -2.151261 -0.891722
H  0.988056 -2.143222 0.722567
H  1.677061 1.722194 -0.33228
H  2.428479 1.796371 1.283767
H  2.752479 -1.867021 -1.043909
H  1.87647 -0.477067 -1.734553
H  3.936869 1.050801 -1.401369
H  4.699384 1.160113 0.212356
H  4.835522 -0.345885 -0.741997
H  -2.110595 0.679201 1.953154
H  -3.205594 -0.714175 1.609886
H  -1.925357 1.599202 -1.807235
H  -1.305257 2.137793 -0.199415
H  -3.654167 1.337262 0.100122
H  -2.810397 -1.072092 -1.206627
