program: Gaussian 09
title: 000268864
version: EM64L-G09RevD.01
frameworkgroup: C1[X(C6H8N4O2)]
method: RPBEPBE
basis: SDD
operation: Freq
keyword: #pfreq=noraman
keyword: PBEPBE/SDD
title: #p freq=noraman PBEPBE/SDD
converged: NO YES NO NO
title: Mulliken charges:
elementType: O O N N N N C C C C C C H H H H H H H H
charge: -0.267744 -0.338174 -0.402538 -0.114937 -0.606217 -0.610907 0.366480 -0.619403 -0.082230 -0.228394 0.208762 0.192120 0.236091 0.271665 0.330860 0.264605 0.390408 0.320477 0.356916 0.332159
chargesum: 0.00000
title: Mulliken charges with hydrogens summed into heavy atoms:
elementType: O O N N N N C C C C C C
charge: -0.267744 -0.338174 -0.071678 -0.114937 0.104668 0.078168 0.366480 -0.111647 -0.082230 0.036211 0.208762 0.192120
polarizability: 1.22478293e+02 -5.46159044e+00 1.12806596e+02 -6.36850886e+00 -1.07759711e+00 5.63633645e+01
1716.lowfreq: -1.0927 -0.0009 -0.0007 -0.0006 4.9034 12.4219 62.7656 83.8205 102.1673
frequency: 62.7459 83.8109 102.1657 155.6496 171.8826 191.2526 275.3890 297.3845 407.3003 422.3501 481.2757 522.1407 556.4439 581.9403 638.6158 650.8906 662.0760 669.8641 676.5524 687.5084 761.9347 787.6447 801.8413 855.9677 857.3093 909.3946 926.8269 1050.5682 1072.2476 1104.3407 1129.4699 1164.4457 1200.5794 1247.7119 1282.2666 1332.7719 1343.3308 1375.8392 1412.7044 1451.6061 1472.5361 1558.3467 1578.2967 1604.0277 1635.0816 1659.1708 3029.2845 3099.3998 3244.2259 3255.1822 3497.7249 3578.8009 3605.4369 3669.4101
redmass: 7.0982 5.3667 6.5653 5.5007 5.3807 5.7984 4.1370 5.0913 6.2176 2.0820 3.4387 3.7950 1.3333 2.1774 3.5767 2.7607 3.3759 1.3734 1.8762 1.1404 8.3199 1.9978 2.5535 1.0993 4.7733 2.7537 3.6477 2.4592 1.7591 1.6171 2.3132 1.6254 3.4373 1.8182 1.4192 2.8896 2.8591 3.9833 4.5345 1.1031 3.3105 1.9422 6.7679 1.7457 1.5637 5.3679 1.0591 1.1041 1.0992 1.0672 1.0461 1.0823 1.0881 1.1035
irintensity: 3.0014 6.5531 6.8117 27.5065 11.3088 5.9669 9.6396 7.3069 8.3991 7.9896 4.5704 10.5989 108.1681 30.7559 18.8766 51.2312 63.7188 27.9138 134.4778 144.9898 10.0009 17.5800 7.2485 187.5656 9.1830 23.4227 1.2575 8.4465 4.0950 5.5672 6.3850 9.1388 22.1902 13.3317 27.7573 48.0394 99.9262 23.4638 40.3164 20.2958 80.9709 135.2078 118.6975 496.2345 65.4120 285.8502 10.1719 5.4111 0.6551 372.0003 63.6927 58.4987 56.8847 65.8547
temp: 298.150 k
press: 1.00000 atm
elementType: 8 8 7 7 7 7 6 6 6 6 6 6 1 1 1 1 1 1 1 1
symmnumber: 1
zpe: 399869.5 jmol-1
zpe.correction: 0.152302 hartree
zpe.thermalcorrener: 0.162997 hartree
zpe.thermalcorrenthalpy: 0.163941 hartree
zpe.thermalcorrgfe: 0.115527 hartree
zpe.sumelectzpe: -602.061889 hartree
zpe.sumelectthermal: -602.051194 hartree
zpe.sumelectthermalent: -602.050250 hartree
zpe.sumelectthermalfe: -602.098664 hartree
dipole: 3.2587 1.8080 0.5532
dipole: 3.7675
quadrupole: -77.3736 -56.4456 -69.6117
quadrupole: -0.8636 -3.9117 5.4824
quadrupole: -9.5633 11.3647 -1.8014 -0.8636 -3.9117 5.4824
hfenergy: -602.2141916 hartree
pointgroup: C01 [X(C6H8N4O2)]
dipole: 1.3464091 0.5978858 0.1635502 debye
dipolederiv: -0.9963885 0.320941 -0.0715815 0.3438704 -0.7182961 -0.0608665 -0.3234881 0.039319 -0.445017 -1.0356275 -0.1553128 0.1027526 -0.2474806 -0.9285864 0.0856048 0.0735265 0.0946794 -0.4235516 -0.2572906 0.080487 0.0367468 0.137878 -0.5359083 -0.0748652 0.0205247 -0.0195913 -0.22537 -0.4392132 0.1222485 0.0559313 -0.0013729 -0.261083 -0.0427275 0.074873 -0.0232594 -0.2644538 -0.6863553 -0.0162484 0.1230847 0.116492 -1.0413021 -0.0588363 0.1030233 -0.1509979 -0.529388 -1.2596533 0.3137171 0.103672 0.3546973 -0.4687527 -0.0907823 0.1562998 -0.082935 -0.6734162 0.4737754 -0.0720905 -0.0891073 -0.1015905 0.4393001 0.0569176 -0.2375105 -0.0501084 -0.0182638 -0.4126489 -0.1204542 -0.1427435 -0.206473 0.0438717 -0.0418066 -0.2249858 -0.0251008 0.0039101 -0.1942884 0.0893148 0.0116516 0.3732355 -0.4909213 -0.0745456 0.0481393 -0.0225043 -0.0613949 0.2108265 -0.0538721 -0.1783457 -0.0936153 0.0540073 0.0354175 -0.1204974 0.0123212 0.0007825 1.158908 -0.3652541 0.2941456 -0.3745578 1.256368 0.3032331 0.6557872 0.3293147 0.4731309 1.6317897 -0.2003539 -0.32509 -0.249891 1.4511704 0.042703 -0.4166696 0.0275559 0.3521608 0.0253964 0.0221528 0.0511377 0.0548087 -0.0146355 -0.1063712 0.0395293 -0.0497939 0.0412645 0.0678586 0.0154135 -0.042254 -0.0020478 0.0073686 0.096234 0.0008501 0.0335171 0.0655449 0.1956658 0.0141897 0.0599348 0.0149556 0.2543093 0.0143979 0.0512338 0.0128754 0.3090688 0.1041244 -0.0219048 0.0429664 -0.021627 -0.005634 0.0237564 0.0475577 0.0231575 0.1762585 0.6882895 0.0500879 -0.0211128 -0.063212 0.2735823 -0.0627367 0.0698891 -0.0816583 0.2652936 0.201459 0.0562124 -0.0929293 0.0510664 0.2308102 -0.0657223 -0.1269069 -0.0613034 0.2394619 0.2866559 -0.0514332 0.0317432 -0.029915 0.2683238 0.0094225 0.0532292 0.0019724 0.3531733 0.2367166 -0.0278407 0.0493975 -0.0552211 0.1860078 0.0115734 0.0555956 -0.0074599 0.3608054 unknown
polarizability: 120.4977514|-5.701075|113.6466276|-10.6554967|2.4639374|57.5038741 unknown
InChI: InChI=1S/C6H8N4O2/c7-4(11)1-3-5(6(8)12)10-2-9-3/h2,9H,1,7-8H2
charge 0 multiplicity 1
20 atoms
O  -3.419659 0.588072 -0.23001
O  0.341237 -2.30576 0.275358
N  0.146308 2.046947 0.277721
N  1.962783 0.93387 -0.457231
N  -2.262222 -1.437546 -0.447539
N  2.518729 -1.7856 -0.382997
C  -0.131806 0.697841 0.512725
C  -1.404839 0.216889 1.143751
C  1.004299 0.019969 0.0346
C  1.41096 2.146238 -0.30286
C  -2.470426 -0.189896 0.085033
C  1.244926 -1.437726 -0.005954
H  -1.860423 1.00592 1.764879
H  -1.176692 -0.653042 1.782112
H  -0.492313 2.817078 0.478641
H  1.865193 3.09304 -0.583393
H  -1.410772 -1.971233 -0.190173
H  -2.900956 -1.775568 -1.167294
H  3.176977 -1.042032 -0.62544
H  2.770297 -2.768658 -0.46463
